{"text_format":"1","workbook":"xlsx","n_sheets":37,"sheets":["Validation","RevHistory","MAPP Instructions","1-Program Info","2-Supplier Information","3-Supplier Feasibility","4-Technical Review","5-Investment Timing","6-Process Flow Diagram","7-Capacity Plan","8-Process Controls","SCS List","EPC List","9-Open Issues","10-Supplier Commitment","11-Risk Assessment (Ext)","11-Risk Assessment (Int)","Final Risk Assessment","Coating & Plating","Diecast Aluminum & Magnesium","Diecast Zinc","Ductile Iron","Electrical","Fastener","Springs","Forging","Grey Iron","Machined Part","Plastic Molding","Powdered Metal","Press Fit","Projection Welding","Rubber","Squeeze Cast","Stamping 1 of 2","Stamping 2 of 2","Steel Quality"],"not_rendered":{"charts":0,"images":11,"macros":1,"external_links":0,"defined_names":160,"comments":26,"pivot_tables":0},"unopened":[],"bounds":{"document_bytes":16777216,"sheet_cells":100000,"rows_first":2000,"rows_last":500,"rows_between":2000,"halvings":0,"cell_chars":16384,"cell_head_chars":4096},"cells_cut":0,"cells_raw":0,"read":"whole","date_system":"1900"}

{"sheet":"Validation","index":0,"n_rows":137,"n_cols":32,"rows_kept":137,"cut":false,"hidden":true,"merged":[[31,18,31,21]]}
["DETCL1","DETCL2","DETSTD",null,"PROCL1","PROCL4","PROCL3",null,"DEFCL1","DEFCL2","DEFCL3",null,"CL1",null,"CI-100V","CI-DR","QS-100V","QS-DR","STD4-8","STD1-3","KPC","CL1","CL2","CL3","CL4","CL5","CL1-CMR","CL2-CMR","CL3-CMR","CL4-CMR","CL5-CMR","Detection Values"]
[1,1,1,null,1,1,1,null,"A","A","A",null,"CL2",null,"1","1","1","1","1","1","1","1","1","1","1","1","1","1","1","1","1","1"]
[2,2,2,null,2,2,2,null,null,"B","B",null,"CL3",null,"2","2","2","2","2","2","2","2","2","2","2","2","2","2","2","2","2","2"]
[3,3,3,null,3,3,3,null,null,null,"C",null,"CL4",null,"3","3","3","3","3","3","3","3","3","3","3","3","3","3","3","3","3","3"]
[4,4,4,null,4,4,4,null,null,null,null,null,"CL5",null,"4","4","4","4","4","4","4","4","4","4","4","4","4","4","4","4","4","4"]
[null,5,5,null,null,5,5,null,null,null,null,null,"CL1-CMR",null,"5A","5A","5A","5A","5A","5A","5A","5A","5A","5A","5A","5A","5A","5A","5A","5A","5A","5A"]
[null,6,6,null,null,6,6,null,null,null,null,null,"CL2-CMR",null,"5B","5B","5B","5B","5B","5B","5B","5B","5B","5B","5B","5B","5B","5B","5B","5B","5B","5B"]
[null,7,7,null,null,null,7,null,null,null,null,null,"CL3-CMR",null,"6A","6A","6A","6A","6A","6A","6A","6A","6A","6A","6A","6A","6A","6A","6A","6A","6A","6A"]
[null,null,8,null,null,null,null,null,null,null,null,null,"CL4-CMR",null,"6B","6B","6B","6B","6B","6B","6B","6B","6B","6B","6B","6B","6B","6B","6B","6B","6B","6B"]
[null,null,9,null,null,null,null,null,null,null,null,null,"CL5-CMR",null,"7A","7A","7A","7A","7A","7A","7A","7A","7A","7A","7A","7A","7A","7A","7A","7A","7A","7A"]
[null,null,10,null,null,null,null,null,null,null,null,null,"CI-100V",null,"7B","7B","7B","7B","7B","7B","7B","7B","7B","7B","7B","7B","7B","7B","7B","7B","7B","7B"]
[null,null,null,null,null,null,null,null,null,null,null,null,"CI-DR",null,"8","8","8","8","8","8","8","8","8","8","8","8","8","8","8","8","8","8"]
[null,null,null,null,null,null,null,null,null,null,null,null,"QS-100V",null,"9","9","9","9","9","9","9","9","9","9","9","9","9","9","9","9","9","9"]
[null,null,null,null,null,null,null,null,null,null,null,null,"QS-DR",null,"10","10","10","10","10","10","10","10","10","10","10","10","10","10","10","10","10","10"]
[null,null,null,null,null,null,null,null,null,null,null,null,"KPC",null,null,null,null,null,null,null,null,null,null,null,null,null,null,null,null,null,null,"Process Control Values"]
[null,null,null,null,null,null,null,null,null,null,null,null,"STD1-3",null,"1","1","1","1","1","1","1","1","1","1","1","1","1","1","1","1","1","1"]
[null,null,null,null,null,null,null,null,null,null,null,null,"STD4-8",null,"2","2","2","2","2","2","2","2","2","2","2","2","2","2","2","2","2","2"]
[null,null,null,null,null,null,null,null,null,null,null,null,null,null,"3","3","3","3","3","3","3","3","3","3","3","3","3","3","3","3","3","3"]
[null,null,null,null,null,null,null,null,null,null,null,null,null,null,"4","4","4","4","4","4","4","4","4","4","4","4","4","4","4","4","4","4"]
[null,null,null,null,null,null,null,null,null,null,null,null,null,null,"5","5","5","5","5","5","5","5","5","5","5","5","5","5","5","5","5","5"]
[null,null,null,null,null,null,null,null,null,null,null,null,null,null,"6","6","6","6","6","6","6","6","6","6","6","6","6","6","6","6","6","6"]
[null,null,null,null,null,null,null,null,null,null,null,null,null,null,"7","7","7","7","7","7","7","7","7","7","7","7","7","7","7","7","7","7"]
[null,null,null,null,null,null,null,null,null,null,null,null,null,null,null,null,null,null,null,null,null,null,null,null,null,null,null,null,null,null,null,"Defect Values"]
[null,null,null,null,null,null,null,null,null,null,null,null,null,null,"A","A","A","A","A","A","A","A","A","A","A","A","A","A","A","A","A","A"]
[null,null,null,null,null,null,null,null,null,null,null,null,null,null,"B","B","B","B","B","B","B","B","B","B","B","B","B","B","B","B","B","B"]
[null,null,null,null,null,null,null,null,null,null,null,null,null,null,"C","C","C","C","C","C","C","C","C","C","C","C","C","C","C","C","C","C"]
[null,null,null,null,null,null,null,null,null,null,null,null,null,null,null,null,null,null,null,null,null,null,null,null,null,null,null,null,null,null,null,"Control Verification"]
[null,null,null,null,null,null,null,null,null,null,null,null,null,null,"100% Verification","Per Control Plan","100% Verification","Per Control Plan","Per Control Plan","Per Control Plan","Per Control Plan","100% Verification","100% Verification","Per Control Plan","100% Verification","Per Control Plan","100% Verification","100% Verification","Per Control Plan","100% Verification","Per Control Plan","100% Verification"]
[null,null,null,null,null,null,null,null,null,null,null,null,null,null,null,null,null,null,null,null,null,null,null,null,null,null,null,null,null,null,null,"Per Control Plan"]
[null,null,null,null,null,null,null,null,null,null,null,null,null,null,null,null,null,null,null,null,null,null,null,null,null,null,null,null,null,null,null,"Demonstrate Upon Request"]
[null,null,null,null,null,null,null,null,null,null,null,null,null,null,null,null,null,null,null,null,null,null,null,null,null,null,null,null,null,null,null,"Other"]
[null,null,null,null,null,null,null,null,null,null,null,null,null,null,null,null,null,null,"Nexteer Plant Data"]
[null,null,null,null,null,null,null,null,null,null,null,null,"Countries",null,"Region",null,null,null,"Plant Name","Address","Country","Region"]
[null,null,null,null,null,null,null,null,null,null,null,null,"ALBANIA",null,"Asia Pacific",null,null,null,"NEXTEER AUTOMOTIVE - PLT01","3900 Holland Rd - Plt 1 ","UNITED STATES OF AMERICA","North America"]
[null,null,null,null,null,null,null,null,null,null,null,null,"ALGERIA",null,"Europe",null,null,null,"NEXTEER AUTOMOTIVE - PLT03","3900 Holland Rd - Plt 3","UNITED STATES OF AMERICA","North America"]
[null,null,null,null,null,null,null,null,null,null,null,null,"ANDORRA",null,"North America",null,null,null,"NEXTEER AUTOMOTIVE - PLT04","3900 Holland Rd - Plt 4 ","UNITED STATES OF AMERICA","North America"]
[null,null,null,null,null,null,null,null,null,null,null,null,"ARGENTINA",null,"South America",null,null,null,"NEXTEER AUTOMOTIVE - PLT05","3900 Holland Rd - Plt 5","UNITED STATES OF AMERICA","North America"]
[null,null,null,null,null,null,null,null,null,null,null,null,"AUSTRALIA",null,null,null,null,null,"NEXTEER AUTOMOTIVE - PLT06","3900 Holland Rd - Plt 6","UNITED STATES OF AMERICA","North America"]
[null,null,null,null,null,null,null,null,null,null,null,null,"AUSTRIA",null,null,null,null,null,"NEXTEER AUTOMOTIVE - PLT07","3900 Holland Rd - Plt 7 ","UNITED STATES OF AMERICA","North America"]
[null,null,null,null,null,null,null,null,null,null,null,null,"BELGIUM",null,null,null,null,null,"NEXTEER AUTOMOTIVE - PLT08","3900 Holland Rd - Plt 8","UNITED STATES OF AMERICA","North America"]
[null,null,null,null,null,null,null,null,null,null,null,null,"BERMUDA",null,null,null,null,null,"CHONGQING NEXTEER STEERING SYSTEMS CO., LTD. - PLT58","No 409 Deyuan Rd, Degan Str., Jiangin Dist.","CHINA","Asia Pacific"]
[null,null,null,null,null,null,null,null,null,null,null,null,"BOLIVIA",null,null,null,null,null,"DONGFENG NEXTEER STEERING SYSTEMS (WUHAN) CO., LTD. - PLT55","104M1 Block, Economic & Technological Dev. Zone","CHINA","Asia Pacific"]
[null,null,null,null,null,null,null,null,null,null,null,null,"BOSNIA & HERZEGOVINA",null,null,null,null,null,"NEXTEER AUTOMOTIVE (SUZHOU) CO., LTD. - PLT51","72 Fengli St. Suzhou Industrial Park","CHINA","Asia Pacific"]
[null,null,null,null,null,null,null,null,null,null,null,null,"BOTSWANA",null,null,null,null,null,"NEXTEER LINGYUN DRIVELINE (ZHUOZHOU) CO., LTD. - PLT52","Songlindian Town","CHINA","Asia Pacific"]
[null,null,null,null,null,null,null,null,null,null,null,null,"BRAZIL",null,null,null,null,null,"NEXTEER AUTOMOTIVE (SUZHOU) CO., LTD. - PLT53","72 Fengli St. Suzhou Industrial Park","CHINA","Asia Pacific"]
[null,null,null,null,null,null,null,null,null,null,null,null,"BRITISH VIRGIN ISLANDS",null,null,null,null,null,"NEXTEER LINGYUN DRIVELINE (WUHU) CO., LTD. - PLT54","18 Huaihai Rd Wuhu Economic & Tech Dev","CHINA","Asia Pacific"]
[null,null,null,null,null,null,null,null,null,null,null,null,"BULGARIA",null,null,null,null,null,"NEXTEER AUTOMOTIVE (SUZHOU) CO., LTD. - PLT56","18 Dongchang Rd. Suzhou Industrial Park","CHINA","Asia Pacific"]
[null,null,null,null,null,null,null,null,null,null,null,null,"BURUNDI",null,null,null,null,null,"NEXTEER AUTOMOTIVE SYSTEMS (LIUZHOU) CO., LTD","No. 5 Cheyuan Hengwu Rd, Yufeng District","CHINA","Asia Pacific"]
[null,null,null,null,null,null,null,null,null,null,null,null,"CAMEROON",null,null,null,null,null,"STEERINGMEX PLT61","1721 Rio Hondo Street, CD Rio Bravo Bermuda","MEXICO","North America"]
[null,null,null,null,null,null,null,null,null,null,null,null,"CANADA",null,null,null,null,null,"STEERINGMEX PLT63","Calle Camino a San Ildefonso No. 200 Parque Ind. Finsa QRO. II","MEXICO","North America"]
[null,null,null,null,null,null,null,null,null,null,null,null,"CAYMAN ISLANDS",null,null,null,null,null,"STEERINGMEX PLT65","Santa. Rosa de Viterbo # 12","MEXICO","North America"]
[null,null,null,null,null,null,null,null,null,null,null,null,"CHILE",null,null,null,null,null,"STEERINGMEX PLT66","Av. C.P. Rafael Sesma Huerta #12","MEXICO","North America"]
[null,null,null,null,null,null,null,null,null,null,null,null,"CHINA",null,null,null,null,null,"STEERINGMEX PLT68","Parque Industrial Rio Bravo No. 1445","MEXICO","North America"]
[null,null,null,null,null,null,null,null,null,null,null,null,"COLOMBIA",null,null,null,null,null,"NEXTEER AUTOMOTIVE POLAND SP ZOO TYCHY","Towarowa 6","POLAND","Europe"]
[null,null,null,null,null,null,null,null,null,null,null,null,"CONGO",null,null,null,null,null,"NEXTEER AUTOMOTIVE MOROCCO","Commune de Amer Seflia, Atlantic Free Zone RN4 - lots 45+ & 57+","MOROCCO","Europe"]
[null,null,null,null,null,null,null,null,null,null,null,null,"CYPRUS",null,null,null,null,null,"NEXTEER AUTOMOTIVE POLAND SP ZOO GLIWICE","ODDIZIAL W GLIWICACH UL Leonardo da Vinci 5","POLAND","Europe"]
[null,null,null,null,null,null,null,null,null,null,null,null,"CZECH REPUBLIC",null,null,null,null,null,"NEXTEER INDIA AUTOMOTIVE PRIVATE LTD - PLT81","Plot 98A Phase II Kiadb Ind Area","INDIA","Asia Pacific"]
[null,null,null,null,null,null,null,null,null,null,null,null,"DENMARK",null,null,null,null,null,"RHODES INDIA AUTOMOTIVE PRIVATE LTD","Plot 648, 649 Pace City II Sector 37","INDIA","Asia Pacific"]
[null,null,null,null,null,null,null,null,null,null,null,null,"EGYPT",null,null,null,null,null,"NEXTEER AUTOMOTIVE INDIA PRIVATE LIMITED - PLT83","Site No. 4510, A9, Empire Estate, Chinchwad","INDIA","Asia Pacific"]
[null,null,null,null,null,null,null,null,null,null,null,null,"ESTONIA",null,null,null,null,null,"NEXTEER AUTOMOTIVE INDIA PRIVATE LTD - PLT 84","Plot 6, 6, Phase 5 Mahindra World City ","INDIA","Asia Pacific"]
[null,null,null,null,null,null,null,null,null,null,null,null,"ETHIOPIA",null,null,null,null,null,"NEXTEER AUTOMOTIVE INDONESIA - PLT86","2 Greenland Int'l Ind. Ctr.(GIIC) Bloc BA Kota Deltamas, Sukamahi , Cikarang Pusat","INDONESIA","Asia Pacific"]
[null,null,null,null,null,null,null,null,null,null,null,null,"FINLAND",null,null,null,null,null,"NEXTEER INDUSTRIA E COMERCIO DE SISTEMAS - PLT89","Rua Giuseppe Mandelli 118","BRAZIL","South America"]
[null,null,null,null,null,null,null,null,null,null,null,null,"FRANCE",null,null,null,null,null,"NEXTEER AUTOMOTIVE - PROTOTYPE CENTER","2975 Nodular Dr.","UNITED STATES OF AMERICA","North America"]
[null,null,null,null,null,null,null,null,null,null,null,null,"GERMANY",null,null,null,null,null,"AccuSteer LLC - PLT47","901 D Street","UNITED STATES OF AMERICA","North America"]
[null,null,null,null,null,null,null,null,null,null,null,null,"GHANA",null,null,null,null,null,"NEXTEER AUTOMOTIVE - FLINT PLT 30 C/O GENESEE PACKAGING","2022 North Street","UNITED STATES OF AMERICA","North America"]
[null,null,null,null,null,null,null,null,null,null,null,null,"GIBRALTAR",null,null,null,null,null,"NEXTEER AUTOMOTIVE - PLT 32 EUCLID INDUSTRIES","1655 Tech Dr. Ste B        (051506467)","UNITED STATES OF AMERICA","North America"]
[null,null,null,null,null,null,null,null,null,null,null,null,"GREAT BRITAIN",null,null,null,null,null,"NEXTEER AUTOMOTIVE - PLT 49 REMAN","110 East Ninth Street","UNITED STATES OF AMERICA","North America"]
[null,null,null,null,null,null,null,null,null,null,null,null,"HONG KONG"]
[null,null,null,null,null,null,null,null,null,null,null,null,"HUNGARY"]
[null,null,null,null,null,null,null,null,null,null,null,null,"INDIA"]
[null,null,null,null,null,null,null,null,null,null,null,null,"INDONESIA"]
[null,null,null,null,null,null,null,null,null,null,null,null,"IRAN"]
[null,null,null,null,null,null,null,null,null,null,null,null,"IRELAND"]
[null,null,null,null,null,null,null,null,null,null,null,null,"ISRAEL"]
[null,null,null,null,null,null,null,null,null,null,null,null,"ITALY"]
[null,null,null,null,null,null,null,null,null,null,null,null,"JAPAN"]
[null,null,null,null,null,null,null,null,null,null,null,null,"KAZAKHSTAN"]
[null,null,null,null,null,null,null,null,null,null,null,null,"KENYA"]
[null,null,null,null,null,null,null,null,null,null,null,null,"KOREA"]
[null,null,null,null,null,null,null,null,null,null,null,null,"KYRGYZSTAN"]
[null,null,null,null,null,null,null,null,null,null,null,null,"LAOS"]
[null,null,null,null,null,null,null,null,null,null,null,null,"LIECHTENSTEIN"]
[null,null,null,null,null,null,null,null,null,null,null,null,"LITHUANIA"]
[null,null,null,null,null,null,null,null,null,null,null,null,"LUXEMBOURG"]
[null,null,null,null,null,null,null,null,null,null,null,null,"MADAGASCAR"]
[null,null,null,null,null,null,null,null,null,null,null,null,"MALAWI"]
[null,null,null,null,null,null,null,null,null,null,null,null,"MALAYSIA"]
[null,null,null,null,null,null,null,null,null,null,null,null,"MALI"]
[null,null,null,null,null,null,null,null,null,null,null,null,"MALTA"]
[null,null,null,null,null,null,null,null,null,null,null,null,"MAURITANIA"]
[null,null,null,null,null,null,null,null,null,null,null,null,"MEXICO"]
[null,null,null,null,null,null,null,null,null,null,null,null,"MOLDOVA"]
[null,null,null,null,null,null,null,null,null,null,null,null,"MONACO"]
[null,null,null,null,null,null,null,null,null,null,null,null,"MONGOLIA"]
[null,null,null,null,null,null,null,null,null,null,null,null,"MONTEGENGRO"]
[null,null,null,null,null,null,null,null,null,null,null,null,"MOROCCO"]
[null,null,null,null,null,null,null,null,null,null,null,null,"MOZAMBIQUE"]
[null,null,null,null,null,null,null,null,null,null,null,null,"MYANMAR"]
[null,null,null,null,null,null,null,null,null,null,null,null,"NAMIBIA"]
[null,null,null,null,null,null,null,null,null,null,null,null,"NETHERLANDS"]
[null,null,null,null,null,null,null,null,null,null,null,null,"NEW CALEDONIA"]
[null,null,null,null,null,null,null,null,null,null,null,null,"NEW ZEALAND"]
[null,null,null,null,null,null,null,null,null,null,null,null,"NORTH MACEDONIA"]
[null,null,null,null,null,null,null,null,null,null,null,null,"NORWAY"]
[null,null,null,null,null,null,null,null,null,null,null,null,"OMAN"]
[null,null,null,null,null,null,null,null,null,null,null,null,"PAPUA NEW GUINEA"]
[null,null,null,null,null,null,null,null,null,null,null,null,"PERU"]
[null,null,null,null,null,null,null,null,null,null,null,null,"PHILIPPINES"]
[null,null,null,null,null,null,null,null,null,null,null,null,"POLAND"]
[null,null,null,null,null,null,null,null,null,null,null,null,"PORTUGAL"]
[null,null,null,null,null,null,null,null,null,null,null,null,"ROMANIA"]
[null,null,null,null,null,null,null,null,null,null,null,null,"RUSSIA"]
[null,null,null,null,null,null,null,null,null,null,null,null,"RWANDA"]
[null,null,null,null,null,null,null,null,null,null,null,null,"SAUDI ARABIA"]
[null,null,null,null,null,null,null,null,null,null,null,null,"SERBIA"]
[null,null,null,null,null,null,null,null,null,null,null,null,"SINGAPORE"]
[null,null,null,null,null,null,null,null,null,null,null,null,"SLOVAKIA"]
[null,null,null,null,null,null,null,null,null,null,null,null,"SLOVENIA"]
[null,null,null,null,null,null,null,null,null,null,null,null,"SOUTH AFRICA"]
[null,null,null,null,null,null,null,null,null,null,null,null,"SPAIN"]
[null,null,null,null,null,null,null,null,null,null,null,null,"SUDAN"]
[null,null,null,null,null,null,null,null,null,null,null,null,"SWEDEN"]
[null,null,null,null,null,null,null,null,null,null,null,null,"SWITZERLAND"]
[null,null,null,null,null,null,null,null,null,null,null,null,"TAIWAN, ROC"]
[null,null,null,null,null,null,null,null,null,null,null,null,"TANZANIA"]
[null,null,null,null,null,null,null,null,null,null,null,null,"THAILAND"]
[null,null,null,null,null,null,null,null,null,null,null,null,"TUNISIA"]
[null,null,null,null,null,null,null,null,null,null,null,null,"TURKEY"]
[null,null,null,null,null,null,null,null,null,null,null,null,"UGANDA"]
[null,null,null,null,null,null,null,null,null,null,null,null,"UKRAINE"]
[null,null,null,null,null,null,null,null,null,null,null,null,"UNITED ARAB EMIRATES"]
[null,null,null,null,null,null,null,null,null,null,null,null,"UNITED STATES OF AMERICA"]
[null,null,null,null,null,null,null,null,null,null,null,null,"UZBEKISTAN"]
[null,null,null,null,null,null,null,null,null,null,null,null,"VENEZUELA"]
[null,null,null,null,null,null,null,null,null,null,null,null,"VIETNAM"]
[null,null,null,null,null,null,null,null,null,null,null,null,"ZAMBIA"]
[null,null,null,null,null,null,null,null,null,null,null,null,"ZIMBABWE"]

{"sheet":"RevHistory","index":1,"n_rows":46,"n_cols":5,"rows_kept":46,"cut":false,"hidden":false,"merged":[]}
[null,null,null,null,{"$f":"LOOKUP(2,1/(B:B<>\"\"),B:B)","v":115}]
["Date","Revision","Changes"]
["Initial Release",1,"Adopted by Nexteer Automotive Corporation 9/16/2010"]
["2010-09-30",2,"Corrected cell protection issues"]
["2010-10-05",3,"Various formatting changes to prepare for implementation"]
["2010-10-14",4,"Added Diecast Aluminum & Magnesium Technical Supplement Questions.\nRemoved Aluminum casting Technical Supplement & General Casting Technical Supplement\nAdded Question in Team Feasibility -- Can all of the drawing dimensions/requirements and product specifications be met?"]
["2010-11-18",5,"Added clarification to question #29 -- Stress relieve capability of \"production part\" - Die cast Aluminum & Magnesium Supplement Tab "]
["2010-11-24",6,"Removed Item #4 & #12 on the Machine Part Technical Supplement.  Questions are not applicable to machined parts."]
["2010-12-03",7,"Remove Conditional Formatting in Supplier Response - Section 2"]
["2011-02-28",8,"Added Revisions to the following Technical Supplements: \n     Aluminum & Magnesium Technical Supplement.  \n     Rubber Technical Supplement\n     Plastic Molding Supplement\nSection 3 - Qualification Plan for PPAP; \n     Variable Gages:  All variable gages study plan changed to 10 x 3 x 3 plan.   \n     Attribute Gages:  All attribute gage study plan changed to 50 x 3 x 3. Attribute Gage \n     Analysis"]
["2011-02-28",9,"Added clarification to Section 7 to number each signature section - (7A, 7B, 7C, 7D) "]
["2011-02-28",10,"Section 6 - Removed requirements indicating when Buyer fills out Kick-Off and Contact Information"]
["2011-02-28",11,"Section 6 - Definitions clarified"]
["2011-02-28",12,"MAPP Instructions -- Clarification was added.  \n    STEP 4 -- If the print is not road mapped by Nexteer,  the Supplier is required to \n    manually road map the print.\n    STEP 10 -- New Instruction added -- Nexteer Buyer or AQE will notify the Supplier of any \n    updates that are required after the original MAPP submission by the\n    Supplier."]
["2011-04-20",13,"Section 3 - Removed reference to \"Required upon Nexteer Request\" in Section 3 Title\n\nSection 7 A & Section 7C - Removed Supplier Operations signature being required.  This was redundant to Manufacturing signature.  Updated Title Block in Section 7A -- Removed \"Unless Directed by Nexteer\""]
["2011-05-02",14,"Added column to Section 3 - \"Required Capability Study -- Yes or No\""]
["2011-05-04",15,"MAPP Instruction Sheet:\nStep 4 - Section 3 Take out \"the Buyer will notify you if this section is required\"\nStep 5- Section 4 Take out \"the Buyer will notify you if this section is required\""]
["2011-06-17",16,"Section 2 - Added question  - \"Have Lessons Learned been reviewed between Nexteer and Supplier (i.e., for similar parts and processes)?\"\n---------------------------------------\nAdded the following Technical Supplements (Far right Tabs on MAPP Template):  \n* Squeezecast\n* Diecast\n* Ductile Iron\n* Grey Iron\n* Updates to Machining Process\n---------------------------------------\nSection 6 - Clarification was added to Quoted Tool Capacity -- 100 working hours is based on a 5 day work week.\n---------------------------------------\nEntire MAPP Template - Changed Nexteer \"Customer Specific Requirements\" to Nexteer \"Supplier Requirements\"\n---------------------------------------\nSection 7 - Consolidated Section 7 to allow one set of signature approvals for Nexteer and one set of signature approvals for Supplier.\n---------------------------------------\nSection 6  - Renamed,  \"Key Date Information\" from \"Kick-Off Information\"\n---------------------------------------\nUpdated MAPP Instruction Tab to reflect Section 7 Signature Requirement changes."]
["2011-10-12",17,"Added Section 9:  APQP Timing Plan\n--------------------------------------------------------\nInstructions updated to include Section 9 - APQP Timing Plan\n--------------------------------------------------------\nUpdated Diecast & Aluminum Technical Supplement Questions #22 & #23:\n    22) How many dies and cavities per die are planned? How many slides and core pulls?\n    23) How many pieces per day are expected for one die / machine?\n--------------------------------------------------------\nAdded Numbering Scheme to Line Items for easy identification in Sections 1 & 2.\n--------------------------------------------------------\nAdded Line Item 2.48, Section 2 - Technical Supplement Drop-Down Box Feature.  Supplier can select the required Technical Supplement Questionnaire from a Drop-Down Box. (Note:  Supplements are \"hidden\" within the MAPP Template.  Only the required ones will appear once selected from the Drop-Down Box)"]
["2012-02-24",18,"Section 1 - added definition to question 1.10 - scheduling lead time\n                - Row 3, added comments in the Part Number, Revision, and Part Description (Part Name) fields to describe the File Name and \n                  Saving Feature:  The Part Number, Revision, and Part Description must be filled out in order for the file save function to work \n                  properly.  If these fields are not filled out, then the other option, upon saving this file, is to remove all brackets from the auto-\n                  populated file name, in order to properly save this file. \n--------------------------------------------------------\nSection 3 - changed PPK and CPK to =/> vs. = 1.67 and = 1.33\n                - Column header titled \"Description of Control or Verification Method\" was enhanced to add examples of Xbar&R, Variable/Attribute \n                  Gage Description \n                - Column header titled \"General Comments & Mitigation Plan\" was enhanced to add more description such as Sampling Plan, Size & \n                   Frequency\n                - Column E, titled \"Class\", QCI was removed from the drop down menu\n--------------------------------------------------------\nSection 10 - New section titled Capacity Plan was added to determine the plan from a tooling, machine, and cycle time standpoint\n--------------------------------------------------------\nMAPP Instruction Tab - Added that the U.S. English language version of this document shall be the official version.  Any translations of this document will be for reference only.\n--------------------------------------------------------"]
["2012-10-01",19,"Supplement Section - Updated the Die Cast Supplement to add questions 21 and 25\nGeneral - Implemented the use of ISO8601 common date format\nSection 1 - Added new question 1.1\n                - Added clarification to question 1.9; material fab and raw material\n                - Added question 1.13 on financial stability (question was previously located in section 2)\nSection 2  - Added question 2.4 concerning improvement recommendations   \n                - Added question 2.26 concerning duplicate gages for potential correlation issues\n                - Reviised question 2.32 to ask scorecard color and action plans\n                - Revised question 2.36 concerning traceability                                                  \nSection 3 - Allowed for the ability to insert rows \n                - Added Pass Through dimension column; PE to fill out at Supplier Capability & Selection Review\nSection 7B-PC&L sign-off indicates verification of question 1.1 and any necessary notification to the Trade Compliance Manager"]
["2013-02-26","020","Instructions Tab - Updated Flawless Launch to Perfect Launch\nSection 1 - Removed Covisint references and replaced with Intelex\n                - Updated question 1.4 to include Nexteer Automotive Global Supplier Packaging Manual\n                - Updated question 1.12 to include a reference to the Nexteer Label Template and provided the link to the Portal page.\nSection 2 - Updated question 2.36 for lot size and traceability\n                - Updated question 2.15 to include AIAG CQI process assessment verification\nSection 9 - Updated Item 22 to remove reference to Appendix 39 and replace with F1058 Process Audit Production Readiness Form\nGeneral - Updated links within document to new Nexteer Supplier Portal, Intelex, or other areas of existing document"]
["2013-05-28","021","Section 1 - Updated question 1.9 to clarify the 2+2 material commitment\nSection 2 - Updated question 2.12 to have supplier provide external lab name, if applicable.                \nSection 3 - Moved to a separate tab to allow for a pull from engineering and allow for sorting\n                - Moved \"Required Process Indicies\", \"Required Control or Verification\" and \"Qualification Plan for PPAP\" columns to end of data table \n                  (right of Status) to allow for sorting when document is locked.\nSection 6 - Removed reference to \"QTC\" and \"Quoted\".  \n                - Added new field to calculate the 15% over Annual Tool Capacity\n                - Updated comments to show the Annual Tool Capacity field should be populated by the buyer.\n                - Changed \"Timing Confirmation\" to read \"Nexteer Timing Confirmation\" to clarify that the dates entered are Nexteer Timing \n                  Requirements"]
["2013-10-01",22,"Section 1 - Eliminated question 1.11 concerning 10 day leadtime to match new NSRs.\nSection 2 - Updated question 2.2 to efficiently handle material substitution requests\n                - Added new question 2.3 to help with the efficiency of material substitution requests.\n                - Separated question 2.36 into two questions to separate traceability requirements from lot size control\nSection 3 - Separated column \"Sampling plan, size & frequency; General Comments and/or Mitigation Plan\" into 2 different columns: \n                  \"Sample Size & Frequency of Inspection\" and \"General Comments and/or Mitigation Plans\"\n                - Added 3 new columns: \"Detection Control\", \"Process Control\", \"Defect Handling\"\n                - Added new classes into \"Classes\" column dropdown to reflect QCL classes.\n                - Updated Control or Verification Columns for new available classes\n                - Renamed \"Required Control or Verification\" column to \"Control Verification\"\n                - Renamed \"Process Indices\" column to \"Initial Process Indices\"\n                - Added hyperlinks to easily navigate to attachments B (product characteristic and control levels chart), C (detection control table), \n                  D (process control table) and E (defect handling table) from the NSR's\nSection 9 - Updated to create a true Gantt chart. Supplier must now enter when the event will happen and how long the event will take.\nSection 10 - Corrected name formulas to pull correct fields from Sections 1, 2, 6 & 7 tab\n                  - Locked Days per week field to not allow a number more than 5 to be entered\n                  - Added new field for mitigation capacity plan if the supplier needs more than the allowed 5 days or 100 hours per week.\n                  - Net Available Time field will highlight Red if calculated to be higher than 100\n- Updated Instructions Tab\n- Eliminated \"MAPP EXAMPLE\" tab\n- Added electronic signature anchors on signature page to allow for Docusign to be used"]
["2013-12-01",23,"Instructions Tab:       - Updated to account for the DSS. Note: The DSS may be sent out as an attachment in the Ariba RFQ, by the Buyer.\n                                  - Updated Step 4 to add a link to a \"help guide\" that will have the needed attachments B through E.\n                                  - Added a link to a completed DSS as an example.\n                                  - Updated Step 10 on signing the MAPP to comprehend Docusign.\nSection 1 - Reworded question 1.2 due to timing of registration to Intelex as new suppliers will be unable to register at time of MAPP.\nSection 2 - Eliminated question 2.46 (PPAP Lead Time) as it is comprehended on Section 9.\n                - Updated question 2.41, 2.43 and 2.44.\nSection 3 - Updated Attachment E \"Defect Handling Table\" to remove reference to internal Nexteer procedures.\n                - Added a link in upper left corner to an example of a properly completed Section 3.\n                - Corrected error on Drawing Revision field for auto-population from Section 1.\nSection 6 - Rephrased \"Off Tool Samples\" to \"MQ1\" for consistency with other GSM documents and systems.\nSection 7 - Updated 7A to comprehend Docusign in Supplier Signature area.\nSection 9 - Clarified Column C header to indicate \"# of days after kick-off for START of activity\".\n                - Modified questions for clarification and consistency with the new APQP document\nSection 10 - Clarified \"Process Description\" to specify only the Processes that change the part.\nTechnical Supplements - Updated Technical Supplements for Diecast Aluminum & Magnesium, Stamping 1 of 2, Rubber, and Plastic Molding"]
["2014-05-07",24,"Section 2 - Eliminated steel technical supplement as MAPP is not performed on bulk steel\n               - Combined question 2.28 and 2.29 regarding test equipment into one question\n               - Created new question for Reliability Testing.\nSeciton 3 - Comment added to Required Initial Process Indices column T\n               - Column U, Control Verification, has been corrected for CL2 and CL4 to be 100% Verification.\nSection 10 - Capacity Plan now comprehends duplicate machines within the same process\nProduct Characteristics Control Level Chart (Attachment B) was updated to eliminate the Nexteer Use only column titled \"Statistical Design Target\"\n6.19.2014 -- Minor update to definitions of Maximum Tool Capacity vs Annual Tool Capacity on Section 6 (no rev change required)\n7.22.2014 -- Minor correction to Detection (section 3) for STD2-8 to add 7B as an option."]
["2014-11-24",25,"Section 3 - On a Class Standard of 9-10 and Class Standard 2-8, which are defined as Pass Through, the Required Initial Process Indicies\n                  (Column T) now defaults to a Ppk=/>1.33 (was 1.00)\n                - On a Class Standard of 9-10 and Class Standard 2-8, which are defined as Pass Through, the Qualification Plan for PPAP\n                  (Column V) now defaults to PPAP Checksheet, 5 pc. dimensional layout & capability/gage studies"]
["2015-02-16",26,"Instructions Tab - Updated 11\"x17\" Product Characteristics Help Guide\nSection 1 - Updated question 1.8 to change from ANSIX-12 to EDIFACT\n                - Updated question 1.11 for label specifications\nSection 2 - Added question 2.3 concerning design responsibility\n                - Renumbered remaining questions in Section 2 for addition of question 2.3\n                - Added technical supplement to question 2.51 for Steel Quality Requirement for Specification 33200011\n                - Added technical supplement to question 2.51 for Press Fit \nSection 3 - Updated section for changes to G1331 procedure dated 06FE2015\n                - Added CL3 class\n               - Eliminated STD9-10 from class\n               - Updated CL5, CI-DR, QS-DR, & KPC classes to default to \"Per Control Plan\" for Column U (Control Verification)\n               - Updated Attachment B & Attachment E\nSection 7B - Added questions for ensuring alternative control strategies to G1331 are captured and approved on G1331 Approval Form (X1331)\n                    and that approved form is attached in PMD by AQE/SQE."]
["2015-03-26",27,"Instructions Tab - Updated Section 3 Screen shot due to changes to columns\n                          - Add information on Step 4 for completion of \"Control Verification\" column in Section 3\nSection 3 - Removed default values from \"Control Verification\" column to allow alternative choices to be selected per dropdown\n                - Added red highlight condition if a non-allowable or alternative choice is made in \"Control Verfication\", \"Detection Control\", \n                   \"Process Control\" & \"Defect Handling\" columns. \n               - Eliminated STD2-8 from class\n               - Added STD1-3 and STD4-8 classes"]
["2016-01-20",28,"Section 1 - Updated Question 1.1 to clarify Red highlight on Supplier's \"No\" answer.\n                - Updated Question 1.6 to add note regarding approved SPI submission with any future PPAPs as required.\nSection 2 - Removed Heat Treat Supplement from MAPP, removing it from 2.54 \n               - Added Question 2.1 to read \"Do you understand ASME Y14.5 Geometric Dimensioning and Tolerancing (GD&T) standard?\"\n               - Added Question 2.2 to read \"Have you received the Design Severity & Sensitivity (DSS) document from Nexteer?\"\n               - Added Question 2.9 regarding MCA Open Items and Improvement verfiication\n               - All Section 2 questions have been renumbered with addition of new questions\n               - Modified Question 2.7 regarding Lessons Learned, to include confirmation of review on Global Look Across alerts \n                    and Intelex Problem Cases\n               - Modified Question 2.20 regarding CQI special process assessments\nSection 5 - Updated Supplier Contacts titles to match Nexteer terminology\nSection 10 - Corrected error on dropdown for Dedicated vs. Shared\nMachined Parts Technical Supplement added question 24\nForgings Technical Supplement updated to correspond with MCA survey\nDie Cast Aluminum Technical Supplement added questions and removed non-pertinent questions."]
["2016-05-04",29,"Section 3 - Updated the Required Initial Process Indices (Cpk & Ppk values) for CL1, CL2, CL4, CL5 and Standard classes to be consistent with\n                 the Nexteer Supplier Requirements (revision date March 1, 2016)\nStampings 1 of 2 Technical Supplement - added questions 2 & 3, and renumbered remaining questions\nStampings 2 of 2 Technical Supplement - added reference to QCL's, gage description, eliminated Hole Sizes and Processing Note 2"]
["2016-08-03",30,"Sections 1 & 2 - Defined internal Nexteer acronyms to eliminate confusion throughout the document\nSection 2 - Updated comments in question 2.54 Technical Supplement to require Steel Quality Technical Supplement if the drawing requires\n                 specification #33200011\nSection 3 - Updated Product Characteristic Charts Attachments B, C, D, and E based on changes to procedure (G-1331) dated 01JL16\n               - Updated Qualification Plan for PPAP for CL3 class to include the words \"If required\" for capability studies\n               - Corrected Conditional formatting for values in Column T for the STD classes\nStampings 2 of 2 Technical Supplement - Reworded die sensoring proposal statement to require the proposal be submitted by the supplier and \n                                                            approved by the Nexteer AQE prior to the award of business\n                                                          - Reworded die strip diagram statement to indicate that concept die strip layouts are required to be \n                                                             submitted by the supplier and approved by the Nexteer AQE prior to technical review.\nInstructions Tab - Corrected Technical Supplement Question reference to be more dynamic to allow for future changes to MAPP\n                        - Updated Product Characteristic Control Level chart link to reflect changes to procedure (G-1331) dated 01JL16"]
["2017-10-18",31,"Section 2 - Added question 2.8 \"If part is outsourced from Nexteer, have ME lessons learned from the part development been shared with \n                 your organization?  Have the following part documents also been shared (WI, PFD, PFMEA, CP, LSR, fixture and gaging details)?\"\n               - Added question 2.14 \"Will all capital and tooling be in your final plant location(s) at the time of PPAP submission?\"\n               - Added question 2.22 \"Is this part being outsourced from Nexteer (meaning has this part been manufactured in a Nexteer plant \n                 prior to this MAPP being completed)?\"\n               - Added question 2.23 \"If part is outsourced from Nexteer, has a Nexteer manufacturing plant site process walk and Nexteer \n                  PFMEA/Control Plan Review been scheduled?  Note: The Nexteer ME is the most knowledgeable in the effected part(s)\n                  manufacturing process history and must participate in the detailed MAPP review.\"\n               - Added question 2.24 \"If part is outsourced from Nexteer, has an exit PPAP been provided from the Nexteer plant?\"\n               - Updated question 2.38 (now 2.43) to include IATF16949 Cert option and ISO9001 Cert only Plan requirement\n               - Updated question 2.41 (now 2.46) to include traceability records system evidence requirement prior to PPAP (per G1783)\n               - Added question 2.55 \"Have you been directed by Nexteer to use a particular supplier for sub-components?\"\n               - Updated 2.50 (now 2.56)  to include a requirement for the supplier to provide a Product & Component Risk \n                 Assessment for Sub-Suppliers\n               - Updated 2.52 (now 2.58) to require a team composition and workload percentage document for the Nexteer program.\nSection 3 - Updated comment box on Column R (Required Capability Study) to add the comment: \"Note: If a Capability Study is \n                 not required, it is still expected that the required initial process indices shown in Column U would be met.\"\n               - Updated comment box on Column V (Qualification Plan for PPAP) to correct the comment regarding number of pieces \n                  required for dimension layout\n               - Added 5 more Classes in the dropdown on Column E (Class) for Customer Manufacturing Requirements \n                 (CL1-CMR through CL5-CMR) to coordinate to changes on G1331\n               - Updated comment box in Column E (Class) and Column M (Sample Size & Frequency of Inspection) to comprehend \n                  the CMRs (Customer Manufacturing Requirements)\nSection 7b - Updated to include Buyer and Program Manager signature if question 2.13 is answered NO\n                - Removed note regarding notification to Trade Compliance Manager by PC&L representative. Per PC&L procedure update, \n                  responsibility transferred to Global Vendor Master Setup Team.\nInstructions Tab - Added comment before Step 5 to comprehend the CMRs (Customer Manufacturing Requirements)"]
["2018-04-06",32,"Section 1 - Added column for Mitigation Plan Owner Name to be populated if a Mitigation Plan is required. An actual name should be used.\nSection 2 - Added column for Mitigation Plan Owner Name to be populated if a Mitigation Plan is required. An actual name should be used.\n                - Added question 2.10, \"In the drawing block (in the lower right hand corner) is a template number populated? If no, contact your \n                  Nexteer AQE immediately. Examples of template numbers: CISTMPxxxx, HSTMPxxx, EPSTMPxxx, HPSTMPxxx, \n                  HPSGTMPxxxx, etc.\" to ensure the Nexteer AQE compares the template with applications drawing to review for \n                  differences if no template number provided.\n                - Added technical supplement for Powdered Metal to question 2.60 (now 2.61)\nSection 3 - Added column for Mitigation Plan Owner Name to be populated if a Mitigation Plan is required. An actual name should be used.\n                - Removed Comments in Column W and defaulted file to all 335 rows being expanded due to protection issues\n                - Added column for tracking if feature or dimension is included in the Early Production Containment (EPC) Plan.\n                - Updated Column G (Pass Through) to allow for answers of N (No), Y-Audit (Yes with Audit Check), and \n                  Y-Error Proof (Yes with Error Proofing)\nSection 7 - Added ME Signature line. ME is required to sign the MAPP if question 2.22 (now 2.23) is answered \"Yes\"\n                - Clarified required AQE/SQE signature line as AQE/SQE in region of Supplier Manufacturing Location \n                - Added optional signature line for AQE/SQE in region of Nexteer Receiving Plant                \n                - Added a note below all signatures to ensure that changes to approved MAPP are reapproved by the AQE and affected\n                  team member(s)\nSection 8 - Added column for Mitigation Plan Owner Name to be populated if a Mitigation Plan is required. An actual name should be used."]
["2019-02-20",33,"Section 1 - Added question 1.6 to confirm the supplier complies with applicable OEM Customer Specific Requirements\n                - Removed \"web-EDI\" from question 1.8 (now 1.9)\nSection 2 - Merged questions 2.18 and 2.19 regarding similar parts already produced by Supplier\n               - Added new question 2.19 to capture mechanism to ensure correct tool is used when parts are \"near identical\".\n               - Removed references to TS16949 in question 2.44\nDiecast Aluminum & Magnesium Technical Supplement - Added question 43 \"Will you use automatic robot spraying system on this project?\"\n12NO19 -- Clarified note on Class field to include DSS."]
["2021-10-15",100,"Revision level intentionally set to 100 as major changes to this document results in a new form/function of MAPP Document\nChanges made include: \n            - Reordering/numbering of pertinent sections of the MAPP to allow for ease of processing\n            - Elimination of redundency in processes\n            - Define workflow of the MAPP Process \n            - Clarify responsiblity of each step in the process"]
["2022-02-17",101,"Changes made include: \n            - Adding a section in 1-Program Info tab to indicate the tabs that are not considered \"Complete\" \n            - Formatting changes on 4-Technical Review tab to ensure all necessary items are completed (to show MAPP as Complete) \n              or not accounted for if not required\n            - Updated Instructions and 8-Process Controls to remove \"Pass Through Characteristics\" and replace with \"Vehicle Interface\"\n            - Updated 1-Program Info tab to pull \"Final MAPP Review Date\" from Sourcing (IPM) and calculate other Due Dates accordingly\n            - Removed \"QTC\" from tab 7-Capacity Plan"]
["2022-03-11",102,"Changes made include: \n            - Locked down the MAPP review due date on \"1-Program Info\" tab. This must pull from the Sourcing Record\n            - Updated Process Indices in Section 8 (Process Controls) to change \"=/> 1.67\" to \"> 1.67\" for CL1, CL2, CL4 & CL5 classes\n            - Updated Process Indices in Section 8 (Process Controls) to change \"=/> 1.33\" to \"> 1.33\" for CL3 class\n            - Corrected MSV pulling into \"7-Capacity Plan\" tab to pull Annual Tool Capacity entered in \"1-Program Info\" tab\n            - Updated Open Issues tab to remove any Technical Supplement data that was added incorrectly due to applicability selected on \n                \"1-Program Info\" tab"]
["2022-03-25",103,"Changes made include: \n          - Updates to allow for running of Sourcing Record / MCA pull to be allowed while onsite in a Nexteer office\n          - Updates to CQI-23 and CQI-27 to just indicate if the assessment is complete rather than require a score.\n          - Protected Workbook to ensure tabs could not get copied or added from other documents"]
["2022-07-15",104,"Minor updates to fix bugs\n          - Confirm password on all sheets is updated for proper control of form. \n          - Locked down all date fields (highlighted in green) on \"1-Program Info\" tab. All dates must pull from the Sourcing Record\n          - Updated MAPP Completion calculation on \"1-Program Info\" tab to ensure that \"Manufacturing Feasiblity\" fields on \n            \"10-Supplier Commitment\" tab are answered for MAPP to be considered \"Complete\"\n"]
["2022-12-07",110,"Changes made include:\n      - Added code for scripting service to allow for Sourcing pull to work on 64-bit Excel to support Nexteer IT move to 64-Bit Office\n      - Updated Completeness Triggers Table on 1-Program Info tab to indicate Pass/Fail per tab also."]
["2024-01-01",111,"Section 8:\n    - Added column to capture Product Characteristic Description during RPA\n    - Added column for SPC control\nAdded SCS List tab"]
["2024-04-02",112,"Bug fixes for Command Buttons and Signature block on tab 10 disappearing (potentially due to Microsoft update)\nUpdated Country list to include missing countries"]
["2025-01-10",113,"Bug fixes for SCS/EPC List button on 1-Program Info tab that didn't have a macro attached to it.  \nBug fixes for calculation of RYG items on 3-Suplier Feasibility and 4-Technical Review tabs not looking at Nexteer Status fields properly"]
["2025-12-02",114,"Bug fix for HTA issue upon Windows 11 update. Rewrite API pull from Sourcing into Module 41"]
["2026-04-14",115,"Include Internal Risk Assessment as part of MAPP status determination.  Risk Assessment should be completed by the AQE during the MAPP Process. *Suppliers are not able to see the Risk Assessment Tabs.\nMinor bug fixes"]

{"sheet":"MAPP Instructions","index":2,"n_rows":102,"n_cols":16,"rows_kept":102,"cut":false,"hidden":true,"merged":[[58,3,58,4],[57,5,57,7],[54,5,54,7],[21,5,21,7],[28,5,28,7],[6,15,6,24],[0,15,0,24],[1,15,1,24],[2,15,2,24],[3,15,3,24],[4,15,4,24],[86,1,86,3],[68,2,68,3],[84,2,84,3],[69,1,69,2],[70,2,70,3],[64,2,64,3],[72,2,72,3],[76,2,76,3],[62,1,62,2],[63,2,63,3],[15,0,15,3],[4,3,6,3],[11,0,11,3],[9,0,10,3],[25,2,25,3],[20,1,20,2],[21,2,21,3],[22,2,22,3],[23,2,23,3],[24,2,24,3],[101,2,101,3],[91,2,91,3],[99,1,99,3],[100,2,100,3],[87,2,87,3],[90,1,90,3],[1,6,5,6],[91,5,91,7],[92,5,93,6],[96,5,96,7],[97,5,97,7],[29,5,29,7],[33,5,33,7],[37,5,37,7],[64,5,64,7],[72,5,72,7],[76,5,76,7],[55,5,56,6],[42,5,42,7],[45,5,45,7],[46,5,46,7]]}
[null,null,null,"The                        MAPP to a PERFECT LAUNCH ",null,null,null,null,null,null,null,null,null,null,null,"The Drawing or Statement of Requirements (SOR), MAPP Template and Design Severity and Sensitivity (DSS) Assessment is sent out with the RFQ."]
[null,null,null,null,null,null,"As explained in the Nexteer internal Yammer post at the link below, please comment in that post if any issues are experienced using this file.  For Suppliers accessing this file and experiencing problems, please contact your Nexteer Buyer and/or Supplier Quality representative to pass along your concerns. \n*Note: Suppliers will receive an error trying to access this link: ",null,null,null,null,null,null,null,null,"If any of these are not available, contact your Nexteer Buyer. The MAPP is required to be returned to the buyer prior to any technical review. "]
[null,null,null,"MAPP = Manufacturability Assessment and Process Plan",null,null,null,null,null,null,null,null,null,null,null,"The MAPP is to be completed in it's entirety and submitted to the buyer no later than the due date "]
[null,null,null,null,null,null,null,null,null,null,null,null,null,null,null," for the supplier to be considered for business award.  "]
[null,null,null,"MAPP is to be completed for one part number/revision level.  Multiple part numbers will not be accepted on a MAPP Template submission, unless they are part of a charted drawing. (Example: Multiple part numbers on a drawing).  Drawing must be minimum of Change Control Release (CCR) Status with Template DSS minimum. The U.S. English language version of this document shall be the official version.  Any translations of this document will be for reference only.",null,null,null,null,null,null,null,null,null,null,null,"The MAPP review is a required step in the sourcing process.  Failure to submit and completed MAPP on or before the due date voids the supplier from sourcing consideration.  MAPPs will not be rescheduled, as this will delay the sourcing and jeopardize the program."]
[null,null,null,null,null,null,null,null,null,null,null,null,null,null,null,{"$f":"'1-Program Info'!H7","v":"[Enter MAPP Due Date]"}]
[null,null,null,null,null,null,"https://www.yammer.com/nexteer.com/#/Threads/show?threadId=1523163685634048",null,null,null,null,null,null,null,null,{"$f":"P1&P2&P3&IF('1-Program Info'!H7=\"[Enter Review Date Here]\",\"to be entered in Program Info tab by Buyer\",TEXT(P6,\"dd-MMM-yyyy\"))&P4&P5","v":"The Drawing or Statement of Requirements (SOR), MAPP Template and Design Severity and Sensitivity (DSS) Assessment is sent out with the RFQ.If any of these are not available, contact your Nexteer Buyer. The MAPP is required to be returned to the buyer prior to any technical review. The MAPP is to be completed in it's entirety and submitted to the buyer no later than the due date [Enter MAPP Due Date] for the supplier to be considered for business award.  The MAPP review is a required step in the sourcing process.  Failure to submit and completed MAPP on or before the due date voids the supplier from sourcing consideration.  MAPPs will not be rescheduled, as this will delay the sourcing and jeopardize the program."}]
[null,null,null,"The MAPP is used to document the supplier's understanding of the requirements and obtain a clear record of what is being committed to by the supplier.  The combination of these two items is critical to a Perfect Launch.  Risks and mitigation plans are part of this process and will ensure a smooth APQP processes."]
[]
["How is the MAPP used?"]
[]
[{"$f":"P7","v":"The Drawing or Statement of Requirements (SOR), MAPP Template and Design Severity and Sensitivity (DSS) Assessment is sent out with the RFQ.If any of these are not available, contact your Nexteer Buyer. The MAPP is required to be returned to the buyer prior to any technical review. The MAPP is to be completed in it's entirety and submitted to the buyer no later than the due date [Enter MAPP Due Date] for the supplier to be considered for business award.  The MAPP review is a required step in the sourcing process.  Failure to submit and completed MAPP on or before the due date voids the supplier from sourcing consideration.  MAPPs will not be rescheduled, as this will delay the sourcing and jeopardize the program."}]
[]
[]
[]
["The MAPP documents the agreement between the Supplier and Nexteer on the key elements of APQP",null,null,null,null,"Use the Links below to go to the appropriate section on the form"]
[]
[]
["Instructions:"]
["Step #1"]
[null,"Nexteer Buyer"]
[null,null,"Complete the \"1 - Program Info\" tab. Required information is highlighted in Green. Optional information is highlighed in Orange. **If an Intelex Parts Management Record (IPM) is available, the IPM Number must be entered in the \"1 - Program Info\" tab for data to be automatically completed. Supplier data may also be pulled. Note: If an MCA record is Complete within the Intelex system, MCA data will update!\n        Includes indicating applicability of Special Process Audits, CQI Assessments and/or Specific Technical Supplements.\n        Confirm with AQE that all applicable audits are selected, if necessary.",null,null,"Program Information"]
[null,null,"Set the date for MAPP review between the Supplier & the cross functional Nexteer team (Buyer, AQE, PE, PC&L, Plant Quality, Program Manager, ME (if necessary)). \n        MAPP Finalized Review date should be 28 days from the Down Select approval date & is autopopulated from the IPM Record\n        Dates may be updated at anytime from the IPM Record by clicking on the \"Pull or Refresh Sourcing / Supplier data\" button"]
[null,null,"Send meeting notice to all the participants.  Conflicts are to be resolved by adjusting the date/time immediately or identify an alternate person."]
[null,null,"The MAPP Submission date is set to seven (7) days prior to the MAPP review date, allowing the Nexteer team to review the submitted document ahead of time to maximize the effectiveness of the meeting.  \n       MAPP Submission date is auto-populated once the MAPP Finalized Review date is entered.\n       Dates may be updated at anytime from the IPM Record by clicking on the \"Pull or Refresh Sourcing / Supplier data\" button"]
[null,null,"Send Completed MAPP template to the Supplier.  MAPP must be sent to Supplier within 24-48 hours from Down Select approval as timing for the Supplier's submission begins immediately!"]
["Step #2"]
[null,"Supplier"]
[null,null,"Complete the \"2 - Supplier Information\" Tab. Required information is highlighted in Yellow.",null,null,"Supplier Information"]
[null,null,"Answer the questions on the \"3 - Supplier Feasibility\" Tab",null,null,"Supplier Feasibility"]
[null,null,null,"Any questions responded to as a \"No\" must include an explanation in the \"Supplier Comments\" column"]
[null,null,null,"Complete Mitigation plan & owner fields prior to the MAPP Review meeting.  "]
[null,null,null,"Mitigation plans will be discussed during the MAPP review with Nexteer"]
[null,null,"Answer the questions on the \"4 - Technical Review\" Tab",null,null,"Technical Review"]
[null,null,null,"Any responses highlighted in Red or Yellow must include an explanation in the \"Additional Explanation and Comments\" column"]
[null,null,null,"Complete Mitigation plan & owner fields prior to the MAPP Review meeting.  "]
[null,null,null,"Mitigation plans will be discussed during the MAPP review with Nexteer"]
[null,null,"Complete the \"5 - Investment Timing\" Tab",null,null,"Investment Timing"]
[null,null,null,"Provide timing estimate for each piece of Equipment"]
[null,null,null,"Provide timing estimate for any Tooling"]
[null,null,null,"Provide timing for any part specific Gages"]
[null,null,null,"If required, provide timing for Facility Investment"]
[null,null,"Include a Process Flow diagram on \"6 - Process Flow Diagram\" Tab",null,null,"Process Flow Diagram"]
[null,null,null,"Document must include: Each Process Step, Machine Description, Material Handling, Rework/Retest Loops, Incoming inpection, Packing, Shipping"]
[null,null,null,"Process Flow Diagram should be pasted in as a Picture (Copy as Picture from the Process Flow Diagram document). If file is saved as a separate PDF file, this file can also be attached into this tab."]
[null,null,"Complete the \"7 - Capacity Plan\" tab",null,null,"Capacity Plan"]
[null,null,"Complete the \"8 - Process Controls\" tab",null,null,"Process Controls"]
[null,null,null,"Complete tab for each dimension, feature or requirement on the drawing, and if applicable, each product specification.\n    Required for all CL1-CL5 & Vehicle Interface OR EQUIVALENT SAFETY COMPLIANCE FEATURES\n    Select standard dimensions may be required at the discretion of a Nexteer PE or AQE"]
[null,null,null,"List each operation and create a line item for each road mapped requirement on the print."]
[null,null,null,"DSS Document used for completing Class column"]
[null,null,null,"Attachment C defines allowable detection methods for Detection Control column"]
[null,null,null,"Attachment D defines proper control methods allowed for charcteristic class for Process Control column"]
[null,null,null,"Attachment E defines proper handling method allowed for characteristic class for Defect Handling column"]
[null,null,null,"Attachment B defines proper verfication method alloed for the characteristic class for the Control Verification column"]
[null,null,"Review the \"9-Open Issues\" tab",null,null,"Open Issues"]
[null,null,null,"Update any necessary information for auto populated open issues",null,"Note: Open Issues will be automatically populated based on responses entered in all tabs if the response is highlighted Red or Yellow."]
[null,null,null,"Add any additional open issues as necessary or directed by Nexteer"]
[null,null,"Review the \"10-Supplier Commitment\" tab",null,null,"Supplier Commitment"]
[null,null,null,"Confirm all dates entered is timing that can be met. Note: If any timing is unable to be met, either Lead Time must be compressed or Nexteer Program Timing dates must be updated.  Failure to commit to these dates will result in a \"FAIL\" status of this MAPP document"]
[null,null,null,"Select one Manufacturing Feasibility response"]
[null,null,"Send completed MAPP template to the Nexteer Buyer"]
["Step #3 - must be completed prior to MAPP Final Review (Step #4)"]
[null,"Nexteer Buyer"]
[null,null,"Reviews MAPP for completeness of Supplier specific tabs"]
[null,null,"Assign a status for each item listed on \"3-Supplier Feasibility\" tab",null,null,"Supplier Feasibility"]
[null,null,null,"Closed & Approved used to close any response from a supplier that is accepted"]
[null,null,null,"Mitigation Plan Approved used to accept suppliers response and provided mitigation plan"]
[null,null,null,"Open used to not accept supplier's response and/or provided mitigation plan"]
[null,null,"Forward MAPP to AQE, PE and PC&L prior to MAPP Review date"]
[null,"Nexteer AQE"]
[null,null,"Reviews MAPP for completeness of Supplier specific tabs"]
[null,null,"Confirm all applicable Special Process Audits, Technical Supplements and/or CQI Assessments are available and completed"]
[null,null,"Assign a status for each item listed on \"4-Technical Review\" tab",null,null,"Technical Review"]
[null,null,null,"Closed & Approved used to close any response from a supplier that is accepted"]
[null,null,null,"Mitigation Plan Approved used to accept suppliers response and provided mitigation plan"]
[null,null,null,"Open used to not accept supplier's response and/or provided mitigation plan"]
[null,null,"Assign a status for each item listed on \"8-Process Controls\" tab",null,null,"Process Controls"]
[null,null,null,"Closed & Approved used to close any response from a supplier that is accepted"]
[null,null,null,"Mitigation Plan Approved used to accept suppliers response and provided mitigation plan"]
[null,null,null,"Open used to not accept supplier's response and/or provided mitigation plan"]
[null,null,"Assign a status for any applicable Technical Supplements"]
[null,null,null,"Closed & Approved used to close any response from a supplier that is accepted"]
[null,null,null,"Mitigation Plan Approved used to accept suppliers response and provided mitigation plan"]
[null,null,null,"Open used to not accept supplier's response and/or provided mitigation plan"]
[null,null,"Send updated MAPP back to Buyer for update to MAPP Review Meeting notice"]
["Step #4"]
[null,"Nexteer Buyer, AQE, PE, PC&L, Supplier, Plant Quality (optional), Program Manager (optional), and ME (as required)"]
[null,null,{"$f":"\"Hold MAPP Review Meeting (led by Nexteer Buyer) on or before MAPP Review Due Date \"&IF('1-Program Info'!H7=\"[Enter Review Date Here]\",\"to be entered in Step 1\",TEXT(P6,\"dd-MMM-yyyy\"))","v":"Hold MAPP Review Meeting (led by Nexteer Buyer) on or before MAPP Review Due Date [Enter MAPP Due Date]"}]
[null,null,"Nexteer Buyer with support from the cross functional team to document changes and updates discussed during this Review"]
["Step #5"]
[null,"Nexteer Buyer & Supplier leads with support of Nexteer AQE, PE, PC&L, Plant Quality, Program Manager and ME (as necessary)"]
[null,null,{"$f":"\"Resolve Open MAPP Issues and obtain signatures by MAPP Finalized Review Due Date \"&IF('1-Program Info'!H7=\"[Enter Review Date Here]\",\"to be entered in Step 1\",TEXT(P6,\"dd-MMM-yyyy\"))","v":"Resolve Open MAPP Issues and obtain signatures by MAPP Finalized Review Due Date [Enter MAPP Due Date]"},null,null,"Open Issues"]
[null,null,null,"MAPP Status of \"INCOMPLETE\" means that all questions are not completed by the Supplier",null,"Note: Open Issues will be automatically updated based on responses entered in all tabs based on the Status entered by Nexteer."]
[null,null,null,"MAPP Status of \"FAIL\" (Red) must be rejected. Red items may be found listed in any of the tabs"]
[null,null,null,"Note: Signature section for both Supplier and Nexteer users will not appear until the MAPP status is \"PASS\""]
[null,null,null,"MAPP Status must be \"PASS\" (Green) to proceed"]
[null,null,{"$f":"\"Signed & Passed MAPP document must be completed prior to MAPP Finalized Review Due Date \"&IF('1-Program Info'!H7=\"[Enter Review Date Here]\",\"to be entered in Step 1\",TEXT(P6,\"dd-MMM-yyyy\"))","v":"Signed & Passed MAPP document must be completed prior to MAPP Finalized Review Due Date [Enter MAPP Due Date]"},null,null,"Nexteer Signatures"]
[null,null,null,"If Actual date exceeds entered MAPP Finalized Review Due Date, SQ & Commercial Director Level Approval is required",null,"Supplier Signatures"]
["Step #6"]
[null,"Nexteer Buyer"]
[null,null,"Upload Signed/Approved MAPP to Intelex Parts Management Record (Docusign)"]
[null,null,"Upload Completed MAPP with PASS Status to Intelex Parts Management Record (Excel)"]

{"sheet":"1-Program Info","index":3,"n_rows":60,"n_cols":34,"rows_kept":60,"cut":false,"hidden":false,"merged":[[59,10,59,11],[59,12,59,13],[41,10,41,13],[2,7,3,8],[26,3,26,8],[2,11,3,11],[24,3,24,8],[48,6,48,8],[49,6,49,8],[50,6,50,8],[46,0,46,5],[42,3,42,8],[43,3,43,8],[44,3,44,8],[47,6,47,8],[47,3,47,4],[1,10,1,13],[2,12,3,13],[2,10,3,10],[4,10,5,10],[9,0,9,9],[7,1,8,2],[7,3,8,3],[7,4,8,4],[7,5,8,6],[1,0,1,9],[2,0,3,0],[2,1,3,5],[4,0,5,0],[4,1,5,3],[6,5,6,6],[6,3,6,4],[12,1,12,2],[14,0,14,9],[22,0,22,9],[16,3,16,8],[17,3,17,8],[18,3,18,8],[20,3,20,8],[19,3,19,8],[47,0,47,1],[51,0,51,1],[51,3,51,4],[51,6,51,8],[53,6,53,8],[52,6,52,8],[53,3,53,4],[52,3,52,4],[52,0,52,1],[53,0,53,1],[48,3,48,4],[49,3,49,4],[50,3,50,4],[48,0,48,1],[49,0,49,1],[50,0,50,1],[0,0,0,13],[42,10,43,13],[28,3,28,8],[30,3,30,8],[32,3,32,8],[34,3,34,8],[36,3,36,8],[38,3,38,8],[40,3,40,8],[10,1,10,8],[11,1,11,8],[12,5,12,8],[4,7,4,8],[7,0,8,0],[7,7,8,9],[6,7,6,9],[6,15,6,16],[7,15,7,16],[4,12,5,13],[7,10,8,13],[4,11,5,11],[6,12,6,13],[58,12,58,13],[54,10,54,11],[55,10,55,11],[56,10,56,11],[57,10,57,11],[58,10,58,11],[53,10,53,13],[54,12,54,13],[55,12,55,13],[56,12,56,13],[57,12,57,13]]}
["Manufacturability Assessment and Process Plan - Program Information",null,null,null,null,null,null,null,null,null,null,null,null,null,null,null,null,null,null,null,null,null,null,null,null,null,"lzvg2c",{"$f":"IF(IFERROR(FIND(\"Z\",AA1,1),IFERROR(FIND(\"z\",AA1,1),0))=2,TRUE,FALSE)","v":true}]
["PART MAPP INFORMATION",null,null,null,null,null,null,null,null,null,"MCA Information / Status"]
[" Part Description:","[Enter Part Name Here]",null,null,null,null,null,"MAPP Overall Status",null,null,"MCA Completed",null,"MCA Color Rating"]
[]
[" Part Number:","[Enter PN Here]",null,null,null,null,null,{"$f":"IF(OR('11-Risk Assessment (Int)'!J2:J3=\"Assessment Incomplete!\",COUNTIF('4-Technical Review'!AA3:AA56,\"\")>0,COUNTIF('3-Supplier Feasibility'!AB3:AB15,\"\")>0,COUNTIF('8-Process Controls'!AC6:AC334,\"\")=329,SUM(U11:U53)>0,COUNTIF('10-Supplier Commitment'!D26:D38,\"[Yes/No]\")>0,AND('10-Supplier Commitment'!A44=\"\",'10-Supplier Commitment'!A46=\"\")),\"INCOMPLETE\",IF(OR(COUNTIF('4-Technical Review'!AA3:AA56,\"R\")>0,COUNTIF('3-Supplier Feasibility'!AB3:AB15,\"R\")>0,COUNTIF('8-Process Controls'!AC6:AC334,\"R\")>0,SUM(T11:T53)>0,COUNTIF('10-Supplier Commitment'!D26:D38,\"No\")>0),\"FAIL\",IF(D7=\"Development Release\",\"DEV REL ONLY\",\"PASS\")))","v":"INCOMPLETE"},null,null,"MCA Score",null,{"$f":"IF(ISBLANK(L5),\"\",IF(L5>89.9%,\"Green\",IF(L5<75%,\"Red\",\"Yellow\")))","v":""}]
[]
[" Drwg Rev:","[Enter Drwg Rev Here]","Print Release Level","[Enter Print Release Level]",null,"MAPP Review Date",null,{"$f":"E8","v":"[Enter MAPP Due Date]"},null,null,"MCA Date",null,null,null,null,"Supplier DUNS:\n(Mfg location)"]
["MAPP Submission Date:              ",{"$f":"D8","v":"[Enter MAPP Due Date]"},null,{"$f":"IF(OR(H8=\"[Enter Review Date Here]\",H8=\"[Enter Date in Sourcing Record]\"),\"[Enter MAPP Due Date]\",H8-21)","v":"[Enter MAPP Due Date]"},{"$f":"IF(OR(H8=\"[Enter Review Date Here]\",H8=\"[Enter Date in Sourcing Record]\"),\"[Enter MAPP Due Date]\",H8-14)","v":"[Enter MAPP Due Date]"},"MAPP Finalized Review Due Date (Supplier MAPP Due Date)",null,"[Enter Review Date Here]",null,null,"MCA Special Process Audits/\nTechnical Supplements",null,null,null,null,"Sourcing Record:"]
[]
["NEXTEER MANUFACTURING LOCATION INFORMATION",null,null,null,null,null,null,null,null,null,"Process","Applicable","Nexteer Score","Supplier Score",null,null,null,null,null,null,null,null,null,null,null,null,null,null,null,null,null,null,null,{"$f":"IF(COUNTIF(L11:L41,\"\")=31,\"\",IF(COUNTIF(AH11:AH41,\"NC\")>0,\"NC\",MIN(AH11:AH41)))","v":0}]
["Nexteer Plant","[Select Nexteer Receiving Plant]",null,null,null,null,null,null,null,null,"Aluminum Casting","No",null,{"$f":"IF(ISBLANK(L11),\"\",IF(ISBLANK('3-Supplier Feasibility'!E20),\"\",'3-Supplier Feasibility'!E20))","v":""},null,null,null,"AC","Diecast Aluminum & Magnesium",{"$f":"COUNTIF(INDIRECT(\"'\"&S11&\"'!AA4:AA64\"),\"R\")","v":0},{"$f":"IF(L11=\"Yes\",COUNTIF(INDIRECT(\"'\"&S11&\"'!I4:I64\"),\"\"),0)","v":0},null,null,null,null,null,null,null,null,null,null,null,null,{"$f":"IF(L11=\"Yes\",IF(OR(M11=\"\",N11=\"\"),\"NC\",MIN(M11:N11)),\"\")","v":""}]
["Manufacturing Address",{"$f":"IF(B11=\"[Select Nexteer Receiving Plant]\",\"[Select Nexteer Plant above]\",VLOOKUP(B11,Validation!S34:V67,2,FALSE))","v":"[Select Nexteer Plant above]"},null,null,null,null,null,null,null,null,"Assembly Process","No",null,{"$f":"IF(ISBLANK(L12),\"\",IF(ISBLANK('3-Supplier Feasibility'!E21),\"\",'3-Supplier Feasibility'!E21))","v":""},null,null,null,"AP",null,null,null,null,null,null,null,null,null,null,null,null,null,null,null,""]
["Manufacturing Country",{"$f":"IF(B11=\"[Select Nexteer Receiving Plant]\",\"[Select Nexteer Plant above]\",VLOOKUP(B11,Validation!S34:V67,3,FALSE))","v":"[Select Nexteer Plant above]"},null,null,"Manufacturing Region",{"$f":"IF(B11=\"[Select Nexteer Receiving Plant]\",\"[Select Nexteer Plant above]\",VLOOKUP(B11,Validation!S34:V67,4,FALSE))","v":"[Select Nexteer Plant above]"},null,null,null,null,"Blow Molding","No",null,{"$f":"IF(ISBLANK(L13),\"\",IF(ISBLANK('3-Supplier Feasibility'!E22),\"\",'3-Supplier Feasibility'!E22))","v":""},null,null,null,"BM",null,null,null,null,null,null,null,null,null,null,null,null,null,null,null,""]
["Is this process / Part being outsourced from Nexteer",null,null,null,null,null,null,null,null,null,"Ductile Iron Casting","No",null,{"$f":"IF(ISBLANK(L14),\"\",IF(ISBLANK('3-Supplier Feasibility'!E23),\"\",'3-Supplier Feasibility'!E23))","v":""},null,null,null,"DI","Ductile Iron",{"$f":"COUNTIF(INDIRECT(\"'\"&S14&\"'!AA4:AA28\"),\"R\")","v":0},{"$f":"IF(L14=\"Yes\",COUNTIF(INDIRECT(\"'\"&S14&\"'!I4:I28\"),\"\"),0)","v":0},null,null,null,null,null,null,null,null,null,null,null,null,""]
["CAPACITY REQUIREMENTS",null,"`",null,null,null,null,null,null,null,"Electrical Product","No",null,{"$f":"IF(ISBLANK(L15),\"\",IF(ISBLANK('3-Supplier Feasibility'!E24),\"\",'3-Supplier Feasibility'!E24))","v":""},null,null,null,"EL","Electrical",{"$f":"COUNTIF(INDIRECT(\"'\"&S15&\"'!AA4:AA14\"),\"R\")","v":0},{"$f":"IF(L15=\"Yes\",COUNTIF(INDIRECT(\"'\"&S15&\"'!I4:I14\"),\"\"),0)","v":0},null,null,null,null,null,null,null,null,null,null,null,null,""]
[null,null,null,null,null,null,null,null,null,null,"ESD Protection","No",null,{"$f":"IF(ISBLANK(L16),\"\",IF(ISBLANK('3-Supplier Feasibility'!E25),\"\",'3-Supplier Feasibility'!E25))","v":""},null,null,null,"ES",null,null,null,null,null,null,null,null,null,null,null,null,null,null,null,""]
["Annual Program Tool Capacity (LCR)","[Enter LCR]","Remarks","[Add any comments]",null,null,null,null,null,null,"Extrusion Process","No",null,{"$f":"IF(ISBLANK(L17),\"\",IF(ISBLANK('3-Supplier Feasibility'!E26),\"\",'3-Supplier Feasibility'!E26))","v":""},null,null,null,"EX",null,null,null,null,null,null,null,null,null,null,null,null,null,null,null,""]
["% over Annual Prog Tool Capacity",0.15,"Remarks","[Add any comments]",null,null,null,null,null,null,"Fasteners","No",null,{"$f":"IF(ISBLANK(L18),\"\",IF(ISBLANK('3-Supplier Feasibility'!E27),\"\",'3-Supplier Feasibility'!E27))","v":""},null,null,null,"FA","Fastener",{"$f":"COUNTIF(INDIRECT(\"'\"&S18&\"'!AA4:AA14\"),\"R\")","v":0},{"$f":"IF(L18=\"Yes\",COUNTIF(INDIRECT(\"'\"&S18&\"'!I4:I14\"),\"\"),0)","v":0},null,null,null,null,null,null,null,null,null,null,null,null,""]
["Maximum Capacity Required (MCR)",{"$f":"IF(OR(B17=\"[Enter LCR]\",B18=\"[Enter %]\"),\"[Calculated Field]\",(B17*(1+B18)))","v":"[Calculated Field]"},"Remarks","[Add any comments]",null,null,null,null,null,null,"Forging","No",null,{"$f":"IF(ISBLANK(L19),\"\",IF(ISBLANK('3-Supplier Feasibility'!E28),\"\",'3-Supplier Feasibility'!E28))","v":""},null,null,null,"FR","Forging",{"$f":"COUNTIF(INDIRECT(\"'\"&S19&\"'!AA4:AA55\"),\"R\")","v":0},{"$f":"IF(L19=\"Yes\",COUNTIF(INDIRECT(\"'\"&S19&\"'!I4:I55\"),\"\"),0)","v":0},null,null,null,null,null,null,null,null,null,null,null,null,""]
[null,null,null,{"$f":"IF(AND(B21<>240,D21=\"[Add comments]\"),\"Comments are required!!\",\"Remarks\")","v":"Remarks"},null,null,null,null,null,null,"Grey Iron\n(Technical Supplement Only)","No",null,{"$f":"IF(ISBLANK(L20),\"\",IF(ISBLANK('3-Supplier Feasibility'!P26),\"\",'3-Supplier Feasibility'!P26))","v":""},null,null,null,"GI","Grey Iron",{"$f":"COUNTIF(INDIRECT(\"'\"&S20&\"'!AA4:AA26\"),\"R\")","v":0},{"$f":"IF(L20=\"Yes\",COUNTIF(INDIRECT(\"'\"&S20&\"'!I4:I26\"),\"\"),0)","v":0},null,null,null,null,null,null,null,null,null,null,null,null,""]
["Nexteer Working Days per Year",240,{"$f":"D20","v":"Remarks"},"[Add comments]",null,null,null,null,null,null,"Grease Application","No",null,{"$f":"IF(ISBLANK(L21),\"\",IF(ISBLANK('3-Supplier Feasibility'!E29),\"\",'3-Supplier Feasibility'!E29))","v":""},null,null,null,"GA",null,null,null,null,null,null,null,null,null,null,null,null,null,null,null,""]
[null,null,null,null,null,null,null,null,null,null,"Injection Molding","No",null,{"$f":"IF(ISBLANK(L22),\"\",IF(ISBLANK('3-Supplier Feasibility'!E30),\"\",'3-Supplier Feasibility'!E30))","v":""},null,null,null,"IM","Plastic Molding",{"$f":"COUNTIF(INDIRECT(\"'\"&S22&\"'!AA4:AA25\"),\"R\")","v":0},{"$f":"IF(L22=\"Yes\",COUNTIF(INDIRECT(\"'\"&S22&\"'!I4:I25\"),\"\"),0)","v":0},null,null,null,null,null,null,null,null,null,null,null,null,{"$f":"IF(L22=\"Yes\",IF(OR(M22=\"\",N22=\"\"),\"NC\",MIN(M22:N22)),\"\")","v":""}]
["PROGRAM TIMING REQUIREMENTS",null,null,null,null,null,null,null,null,null,"I-shaft","No",null,{"$f":"IF(ISBLANK(L23),\"\",IF(ISBLANK('3-Supplier Feasibility'!E31),\"\",'3-Supplier Feasibility'!E31))","v":""},null,null,null,"IS",null,null,null,null,null,null,null,null,null,null,null,null,null,null,null,{"$f":"IF(L23=\"Yes\",IF(OR(M23=\"\",N23=\"\"),\"NC\",MIN(M23:N23)),\"\")","v":""}]
[null,null,null,null,null,null,null,null,null,null,"Machining","No",null,{"$f":"IF(ISBLANK(L24),\"\",IF(ISBLANK('3-Supplier Feasibility'!E32),\"\",'3-Supplier Feasibility'!E32))","v":""},null,null,null,"MP","Machined Part",{"$f":"COUNTIF(INDIRECT(\"'\"&S24&\"'!AA4:AA27\"),\"R\")","v":0},{"$f":"IF(L24=\"Yes\",COUNTIF(INDIRECT(\"'\"&S24&\"'!I4:I27\"),\"\"),0)","v":0},null,null,null,null,null,null,null,null,null,null,null,null,""]
["Kickoff Date","[Enter Date]","Special Requirements","[Add any comments]",null,null,null,null,null,null,"Motor Assembly","No",null,{"$f":"IF(ISBLANK(L25),\"\",IF(ISBLANK('3-Supplier Feasibility'!E33),\"\",'3-Supplier Feasibility'!E33))","v":""},null,null,null,"MA",null,null,null,null,null,null,null,null,null,null,null,null,null,null,null,""]
[null,null,null,null,null,null,null,null,null,null,"Painting Audit","No",null,{"$f":"IF(ISBLANK(L26),\"\",IF(ISBLANK('3-Supplier Feasibility'!E34),\"\",'3-Supplier Feasibility'!E34))","v":""},null,null,null,"PA",null,null,null,null,null,null,null,null,null,null,null,null,null,null,null,""]
["Due Date for PPAP Submission to AQE","[Enter Date]","Special Requirements","[Add any comments]",null,null,null,null,null,null,"Powered Metal","No",null,{"$f":"IF(ISBLANK(L27),\"\",IF(ISBLANK('3-Supplier Feasibility'!E35),\"\",'3-Supplier Feasibility'!E35))","v":""},null,null,null,"PM","Powdered Metal",{"$f":"COUNTIF(INDIRECT(\"'\"&S27&\"'!AA4:AA20\"),\"R\")","v":0},{"$f":"IF(L27=\"Yes\",COUNTIF(INDIRECT(\"'\"&S27&\"'!I4:I20\"),\"\"),0)","v":0},null,null,null,null,null,null,null,null,null,null,null,null,""]
[null,null,null,null,null,null,null,null,null,null,"Press Fit \n(Technical Supplement Only)","No",null,{"$f":"IF(ISBLANK(L28),\"\",IF(ISBLANK('3-Supplier Feasibility'!P30),\"\",'3-Supplier Feasibility'!P30))","v":""},null,null,null,"PF","Press Fit",{"$f":"COUNTIF(INDIRECT(\"'\"&S28&\"'!AA4:AA12\"),\"R\")","v":0},{"$f":"IF(L28=\"Yes\",COUNTIF(INDIRECT(\"'\"&S28&\"'!I4:I12\"),\"\"),0)","v":0},null,null,null,null,null,null,null,null,null,null,null,null,""]
["MQ1 Required Date","[Enter Date]","Special Requirements","[Add any comments and/or quantities required]",null,null,null,null,null,null,"Projection Weld\n(Technical Supplement Only)","No",null,{"$f":"IF(ISBLANK(L29),\"\",IF(ISBLANK('3-Supplier Feasibility'!P31),\"\",'3-Supplier Feasibility'!P31))","v":""},null,null,null,"PW","Projection Welding",{"$f":"COUNTIF(INDIRECT(\"'\"&S29&\"'!AA4:AA26\"),\"R\")","v":0},{"$f":"IF(L29=\"Yes\",COUNTIF(INDIRECT(\"'\"&S29&\"'!I4:I26\"),\"\"),0)","v":0},null,null,null,null,null,null,null,null,null,null,null,null,""]
[null,null,null,null,null,null,null,null,null,null,"Rubber Bonding","No",null,{"$f":"IF(ISBLANK(L30),\"\",IF(ISBLANK('3-Supplier Feasibility'!E36),\"\",'3-Supplier Feasibility'!E36))","v":""},null,null,null,"RB","Rubber",{"$f":"COUNTIF(INDIRECT(\"'\"&S30&\"'!AA4:AA20\"),\"R\")","v":0},{"$f":"IF(L30=\"Yes\",COUNTIF(INDIRECT(\"'\"&S30&\"'!I4:I20\"),\"\"),0)","v":0},null,null,null,null,null,null,null,null,null,null,null,null,""]
["MQ2 Required Date","[Enter Date]","Special Requirements","[Add any comments and/or quantities required]",null,null,null,null,null,null,"Semiconductors","No",null,{"$f":"IF(ISBLANK(L31),\"\",IF(ISBLANK('3-Supplier Feasibility'!E37),\"\",'3-Supplier Feasibility'!E37))","v":""},null,null,null,"SM",null,null,null,null,null,null,null,null,null,null,null,null,null,null,null,""]
[null,null,null,null,null,null,null,null,null,null,"Springs","No",null,{"$f":"IF(ISBLANK(L32),\"\",IF(ISBLANK('3-Supplier Feasibility'!E38),\"\",'3-Supplier Feasibility'!E38))","v":""},null,null,null,"SP","Springs",{"$f":"COUNTIF(INDIRECT(\"'\"&S32&\"'!AA4:AA14\"),\"R\")","v":0},{"$f":"IF(L32=\"Yes\",COUNTIF(INDIRECT(\"'\"&S32&\"'!I4:I14\"),\"\"),0)","v":0},null,null,null,null,null,null,null,null,null,null,null,null,""]
["Run at Rate Date(s)\n(on or before)","[Enter Date]","Special Requirements","[Add any comments]",null,null,null,null,null,null,"Squeeze Casting\n(Technical Supplement Only)","No",null,{"$f":"IF(ISBLANK(L33),\"\",IF(ISBLANK('3-Supplier Feasibility'!P34),\"\",'3-Supplier Feasibility'!P34))","v":""},null,null,null,"SC","Squeeze Cast",{"$f":"COUNTIF(INDIRECT(\"'\"&S33&\"'!AA4:AA37\"),\"R\")","v":0},{"$f":"IF(L33=\"Yes\",COUNTIF(INDIRECT(\"'\"&S33&\"'!I4:I37\"),\"\"),0)","v":0},null,null,null,null,null,null,null,null,null,null,null,null,""]
[null,null,null,null,null,null,null,null,null,null,"Stamping","No",null,{"$f":"IF(ISBLANK(L34),\"\",IF(ISBLANK('3-Supplier Feasibility'!E39),\"\",'3-Supplier Feasibility'!E39))","v":""},null,null,null,"ST","Stamping 1 of 2",{"$f":"COUNTIF(INDIRECT(\"'\"&S34&\"'!AA4:AA28\"),\"R\")","v":0},{"$f":"IF(L34=\"Yes\",COUNTIF(INDIRECT(\"'\"&S34&\"'!I4:I28\"),\"\"),0)","v":0},null,null,null,null,null,null,null,null,null,null,null,null,""]
["DV Sample Date(s)","[Enter Date]","Special Requirements","[Add any comments and/or quantities required]",null,null,null,null,null,null,"Steel Mill","No",null,{"$f":"IF(ISBLANK(L35),\"\",IF(ISBLANK('3-Supplier Feasibility'!E40),\"\",'3-Supplier Feasibility'!E40))","v":""},null,null,null,"SQ","Steel Quality",{"$f":"COUNTIF(INDIRECT(\"'\"&S35&\"'!AA4:AA34\"),\"R\")","v":0},{"$f":"IF(L35=\"Yes\",COUNTIF(INDIRECT(\"'\"&S35&\"'!I4:I34\"),\"\"),0)","v":0},null,null,null,null,null,null,null,null,null,null,null,null,""]
[null,null,null,null,null,null,null,null,null,null,"Threading","No",null,{"$f":"IF(ISBLANK(L36),\"\",IF(ISBLANK('3-Supplier Feasibility'!E41),\"\",'3-Supplier Feasibility'!E41))","v":""},null,null,null,"TH",null,null,null,null,null,null,null,null,null,null,null,null,null,null,null,""]
["PV Sample Date(s)","[Enter Date]","Special Requirements","[Add any comments and/or quantities required]",null,null,null,null,null,null,"Tapping","No",null,{"$f":"IF(ISBLANK(L37),\"\",IF(ISBLANK('3-Supplier Feasibility'!E42),\"\",'3-Supplier Feasibility'!E42))","v":""},null,null,null,"TA",null,null,null,null,null,null,null,null,null,null,null,null,null,null,null,""]
[null,null,null,null,null,null,null,null,null,null,"Tie Rods","No",null,{"$f":"IF(ISBLANK(L38),\"\",IF(ISBLANK('3-Supplier Feasibility'!E43),\"\",'3-Supplier Feasibility'!E43))","v":""},null,null,null,"TR",null,null,null,null,null,null,null,null,null,null,null,null,null,null,null,""]
["Other Milestone Date(s)","[Enter Date]","Special Requirements","[Add any comments]",null,null,null,null,null,null,"Torque Control of Bolts","No",null,{"$f":"IF(ISBLANK(L39),\"\",IF(ISBLANK('3-Supplier Feasibility'!E44),\"\",'3-Supplier Feasibility'!E44))","v":""},null,null,null,"TQ",null,null,null,null,null,null,null,null,null,null,null,null,null,null,null,""]
[null,null,null,null,null,null,null,null,null,null,"Wafer Fabrication","No",null,{"$f":"IF(ISBLANK(L40),\"\",IF(ISBLANK('3-Supplier Feasibility'!E45),\"\",'3-Supplier Feasibility'!E45))","v":""},null,null,null,"WF",null,null,null,null,null,null,null,null,null,null,null,null,null,null,null,""]
["Other Milestone Date(s)","[Enter Date]","Special Requirements","[Add any comments]",null,null,null,null,null,null,"Zinc Diecasting\n(Technical Supplement Only)","No",null,{"$f":"IF(ISBLANK(L41),\"\",IF(ISBLANK('3-Supplier Feasibility'!P37),\"\",'3-Supplier Feasibility'!P37))","v":""},null,null,null,"DZ","Diecast Zinc",{"$f":"COUNTIF(INDIRECT(\"'\"&S41&\"'!AA4:AA27\"),\"R\")","v":0},{"$f":"IF(L41=\"Yes\",COUNTIF(INDIRECT(\"'\"&S41&\"'!I4:I27\"),\"\"),0)","v":0},null,null,null,null,null,null,null,null,null,null,null,null,""]
[]
["Nexteer Start of Production (SOP) Date","[Enter Date]","Special Requirements","[Add any comments]",null,null,null,null,null,null,"Check Applicable Continuous Quality Improvement Assessments"]
["# of EPC Days",90,"Special Requirements","[Add any comments]"]
["Early Production Containment Exit Date",{"$f":"IF(B43=\"[Enter Date]\",\"[Calculated Field]\",B43+B44)","v":"[Calculated Field]"},"Special Requirements","[Add any comments]",null,null,null,null,null,null,"Assessment","Applicable  (Y/N)","Nexteer Score","Supplier Score"]
[null,null,null,null,null,null,null,null,null,null,"CQI-9 Heat Treat ","No",{"$f":"IF(ISBLANK(L46),\"\",IF(ISBLANK('3-Supplier Feasibility'!K20),\"\",'3-Supplier Feasibility'!K20))","v":""},{"$f":"IF(ISBLANK(L46),\"\",IF(ISBLANK('3-Supplier Feasibility'!K20),\"\",'3-Supplier Feasibility'!K20))","v":""},null,null,null,"HT"]
["NEXTEER CONTACT INFORMATION",null,null,null,null,null,null,null,null,null,"CQI-11 Plating","No",null,{"$f":"IF(ISBLANK(L47),\"\",IF(ISBLANK('3-Supplier Feasibility'!K21),\"\",'3-Supplier Feasibility'!K21))","v":""},null,null,null,"CP","Coating & Plating",{"$f":"COUNTIF(INDIRECT(\"'\"&S47&\"'!AA4:AA57\"),\"R\")","v":0},{"$f":"IF(L47=\"Yes\",COUNTIF(INDIRECT(\"'\"&S47&\"'!I4:I57\"),\"\"),0)","v":0}]
["Nexteer Contacts\nEnter (N/A) if not applicable",null,"Nexteer Employee Name","E-Mail Address",null,"Office & Cell Phone Numbers","Signatures",null,null,null,"CQI-12 Coatings","No",null,{"$f":"IF(ISBLANK(L48),\"\",IF(ISBLANK('3-Supplier Feasibility'!K22),\"\",'3-Supplier Feasibility'!K22))","v":""},null,null,null,"CP","Coating & Plating",{"$f":"COUNTIF(INDIRECT(\"'\"&S48&\"'!AA4:AA57\"),\"R\")","v":0},{"$f":"IF(L48=\"Yes\",COUNTIF(INDIRECT(\"'\"&S48&\"'!I4:I57\"),\"\"),0)","v":0}]
["Buyer",null,"[Enter Name]","[Enter E-mail Address]",null,"[Enter Phone #]",null,null,null,null,"CQI-15 Welding","No",{"$f":"IF(ISBLANK(L49),\"\",IF(ISBLANK('3-Supplier Feasibility'!K23),\"\",'3-Supplier Feasibility'!K23))","v":""},{"$f":"IF(ISBLANK(L49),\"\",IF(ISBLANK('3-Supplier Feasibility'!K23),\"\",'3-Supplier Feasibility'!K23))","v":""},null,null,null,"WD"]
["AQE",null,"[Enter Name]","[Enter E-mail Address]",null,"[Enter Phone #]",null,null,null,null,"CQI-17 Soldering","No",{"$f":"IF(ISBLANK(L50),\"\",IF(ISBLANK('3-Supplier Feasibility'!K24),\"\",'3-Supplier Feasibility'!K24))","v":""},{"$f":"IF(ISBLANK(L50),\"\",IF(ISBLANK('3-Supplier Feasibility'!K24),\"\",'3-Supplier Feasibility'!K24))","v":""},null,null,null,"SO"]
["Program Manager",null,"[Enter Name]","[Enter E-mail Address]",null,"[Enter Phone #]",null,null,null,null,"CQI-23 Molding","No",{"$f":"IF(ISBLANK(L51),\"\",IF(ISBLANK('3-Supplier Feasibility'!K25),\"\",'3-Supplier Feasibility'!K25))","v":""},{"$f":"IF(ISBLANK(L51),\"\",IF(ISBLANK('3-Supplier Feasibility'!K25),\"\",'3-Supplier Feasibility'!K25))","v":""},null,null,null,"MO"]
["Production Control & Logistics",null,"[Enter Name]","[Enter E-mail Address]",null,"[Enter Phone #]",null,null,null,null,"CQI-27 Casting","No",{"$f":"IF(ISBLANK(L52),\"\",IF(ISBLANK('3-Supplier Feasibility'!K26),\"\",'3-Supplier Feasibility'!K26))","v":""},{"$f":"IF(ISBLANK(L52),\"\",IF(ISBLANK('3-Supplier Feasibility'!K26),\"\",'3-Supplier Feasibility'!K26))","v":""},null,null,null,"CA"]
["Product Engineer",null,"[Enter Name]","[Enter E-mail Address]",null,"[Enter Phone #]"]
[" Mfg  Eng (Required if outsourcing)",null,"[Enter Name]","[Enter E-mail Address]",null,"[Enter Phone #]",null,null,null,null,"MAPP Completeness Triggers"]
[null,null,null,null,null,null,null,null,null,null,"Supplier Feasibility Tab",null,{"$f":"IF(COUNTIF('3-Supplier Feasibility'!AB3:AB15,\"\")>0,\"INCOMPLETE\",IF(COUNTIF('3-Supplier Feasibility'!AB3:AB15,\"R\")>0,\"FAIL\",\"PASS\"))","v":"INCOMPLETE"}]
[null,null,null,null,null,null,null,null,null,null,"Technical Review Tab",null,{"$f":"IF(COUNTIF('4-Technical Review'!AA3:AA56,\"\")>0,\"INCOMPLETE\",IF(COUNTIF('4-Technical Review'!AA3:AA56,\"R\")>0,\"FAIL\",\"PASS\"))","v":"INCOMPLETE"}]
[null,null,null,null,null,null,null,null,null,null,"Process Control Tab",null,{"$f":"IF(COUNTIF('8-Process Controls'!AC6:AC334,\"\")=329,\"INCOMPLETE\",IF(COUNTIF('8-Process Controls'!AC6:AC334,\"R\")>0,\"FAIL\",\"PASS\"))","v":"INCOMPLETE"}]
[null,null,null,null,null,null,null,null,null,null,"Supplier Commitment Tab",null,{"$f":"IF(OR(AND('10-Supplier Commitment'!A44=\"\",'10-Supplier Commitment'!A46=\"\"),COUNTIF('10-Supplier Commitment'!D26:D38,\"[Yes/No]\")>0),\"INCOMPLETE\",IF(COUNTIF('10-Supplier Commitment'!D26:D38,\"No\")>0,\"FAIL\",\"PASS\"))","v":"INCOMPLETE"}]
[null,null,null,null,null,null,null,null,null,null,"Technical Supplements or Process Audits",null,{"$f":"IF(SUM(U11:U53)>0,\"INCOMPLETE\",IF(SUM(T11:T53)>0,\"FAIL\",\"PASS\"))","v":"PASS"}]
[null,null,null,null,null,null,null,null,null,null,"MAPP Internal Risk Assessment",null,{"$f":"IF('11-Risk Assessment (Int)'!J2:J2=\"Assessment Incomplete!\",\"INCOMPLETE\",\"PASS\")","v":"INCOMPLETE"}]

{"sheet":"2-Supplier Information","index":4,"n_rows":11,"n_cols":4,"rows_kept":11,"cut":false,"hidden":false,"merged":[[0,0,0,3],[10,0,10,3],[2,1,2,3],[3,1,3,3],[4,1,4,3],[1,0,1,3]]}
["Manufacturability Assessment and Process Plan - Supplier Information"]
["Manufacturing Location Information"]
["Supplier Name","[Enter Supplier Name Here]"]
["Supplier Mfg. DUNS Code","[Enter Supplier Duns Code Here]"]
["Manufacturing Address","[Enter Supplier Manufacturing Address Here]"]
["Manufacturing Country","[Select Country from Drop Down]","Manufacturing Region","[Select Region from Drop Down]"]
["Supplier Contacts\nEnter (N/A) if not applicable","Name and Title","E-Mail Address","Office & Cell Phone Numbers"]
["Sales Contact","[Enter Name]","[Enter E-mail Address]","[Enter Phone #]"]
["Program Manager","[Enter Name]","[Enter E-mail Address]","[Enter Phone #]"]
["Quality/APQP Contact","[Enter Name]","[Enter E-mail Address]","[Enter Phone #]"]
["Add an orgchart and people identified as Dedicated vs Assigned to program"]

{"sheet":"3-Supplier Feasibility","index":5,"n_rows":45,"n_cols":28,"rows_kept":45,"cut":false,"hidden":false,"merged":[[35,12,35,13],[23,12,23,13],[30,12,30,13],[31,12,31,13],[33,12,33,13],[25,12,25,13],[27,12,27,13],[28,12,28,13],[29,12,29,13],[32,12,32,13],[19,6,19,7],[20,6,20,7],[21,6,21,7],[18,0,18,1],[26,12,26,13],[22,12,22,13],[34,12,34,13],[29,0,29,1],[30,0,30,1],[31,0,31,1],[21,12,21,13],[18,2,18,3],[19,2,19,3],[20,2,20,3],[32,2,32,3],[21,2,21,3],[23,8,23,9],[24,8,24,9],[25,8,25,9],[18,8,18,9],[19,8,19,9],[20,8,20,9],[21,8,21,9],[24,12,24,13],[1,0,1,11],[2,1,2,11],[2,14,2,16],[1,14,1,16],[0,0,0,19],[40,0,40,1],[42,0,42,1],[43,0,43,1],[44,0,44,1],[19,0,19,1],[20,0,20,1],[32,0,32,1],[21,0,21,1],[22,0,22,1],[23,0,23,1],[24,0,24,1],[25,0,25,1],[26,0,26,1],[27,0,27,1],[28,0,28,1],[39,0,39,1],[18,12,18,13],[19,12,19,13],[36,12,36,13],[13,14,13,16],[14,14,14,16],[17,0,17,4],[8,1,8,11],[14,1,14,11],[10,1,10,11],[13,1,13,11],[12,1,12,11],[9,1,9,11],[17,6,17,10],[11,1,11,11],[11,14,11,16],[3,1,3,11],[4,1,4,11],[3,14,3,16],[4,14,4,16],[5,14,5,16],[8,14,8,16],[9,14,9,16],[10,14,10,16],[12,14,12,16],[5,1,5,11],[6,1,6,11],[6,14,6,16],[7,1,7,11],[7,14,7,16],[44,2,44,3],[34,2,34,3],[35,2,35,3],[36,2,36,3],[37,2,37,3],[38,2,38,3],[36,0,36,1],[37,0,37,1],[38,0,38,1],[35,0,35,1],[34,0,34,1],[41,0,41,1],[41,2,41,3],[33,0,33,1],[24,6,24,7],[20,12,20,13],[17,12,17,15],[22,8,22,9],[39,2,39,3],[40,2,40,3],[42,2,42,3],[43,2,43,3],[22,6,22,7],[23,6,23,7],[22,2,22,3],[23,2,23,3],[24,2,24,3],[25,2,25,3],[26,2,26,3],[27,2,27,3],[28,2,28,3],[29,2,29,3],[30,2,30,3],[31,2,31,3],[33,2,33,3],[25,6,25,7],[18,6,18,7]]}
["Manufacturability Assessment and Process Plan - Supplier Feasibility",null,null,null,null,null,null,null,null,null,null,null,null,null,null,null,null,null,null,null,"Useful\nLinks & Tips"]
["SUPPLIER FEASIBILITY\nCOMPLETED BY SUPPLIER FOR SUPPLIER SELECTION REVIEW",null,null,null,null,null,null,null,null,null,null,null,"Lead Responsibility","Supplier Response","Supplier Comments",null,null,"Mitigation Plan","Mitigation Plan Owner","Status\n(Nexteer Buyer)","◄ See comments"]
[1.01,"Supplier will manufacture this part in a facility (Duns #) currently providing parts to Nexteer.",null,null,null,null,null,null,null,null,null,null,"Commercial",null,null,null,null,null,null,null,null,null,null,null,null,null,null,{"$f":"IF(OR(ISBLANK(N3),ISBLANK(T3)),\"\",IF(AND(N3=\"No\",OR(ISBLANK(T3),T3=\"Open\")),\"R\",IF(AND(N3=\"No\",T3=\"Mitigation Plan Approved\"),\"Y\",\"G\")))","v":""}]
[1.02,"Supplier's Manufacturing location planning to produce this part has a Duns # and is Registered in Nexteer's Intelex Systems and all contacts are up to date",null,null,null,null,null,null,null,null,null,null,"Commercial",null,null,null,null,null,null,null,"Link to Intelex",null,null,null,null,null,null,{"$f":"IF(OR(ISBLANK(N4),ISBLANK(T4)),\"\",IF(AND(N4=\"No\",OR(ISBLANK(T4),T4=\"Open\")),\"R\",IF(AND(N4=\"No\",T4=\"Mitigation Plan Approved\"),\"Y\",\"G\")))","v":""}]
[1.03,"Supplier is capable of Electronic Funds Transfer & is electronic communication capable (EDIFACT).",null,null,null,null,null,null,null,null,null,null,"Commercial",null,null,null,null,null,null,null,null,null,null,null,null,null,null,{"$f":"IF(OR(ISBLANK(N5),ISBLANK(T5)),\"\",IF(AND(N5=\"No\",OR(ISBLANK(T5),T5=\"Open\")),\"R\",IF(AND(N5=\"No\",T5=\"Mitigation Plan Approved\"),\"Y\",\"G\")))","v":""}]
[1.04,"Supplier agrees to meet all of the Nexteer Supplier Requirements (NSR). ",null,null,null,null,null,null,null,null,null,null,"Commercial",null,null,null,null,null,null,null,"Link to NSR's",null,null,null,null,null,null,""]
[1.05,"Supplier agrees to meet all applicable OEM Customer Specific Requirements.",null,null,null,null,null,null,null,null,null,null,"Commercial",null,null,null,null,null,null,null,"Link to NSR's",null,null,null,null,null,null,""]
[1.06,"Supplier agrees to meet Nexteer Packaging Standards available at: https://www.nexteer.com/shipping-labeling-processes/ ensuring that all container designs submitted in the Supplier Packaging Information (SPI) form are compliant.",null,null,null,null,null,null,null,null,null,null,"Logistics",null,null,null,null,null,null,null,"Link to NSR's",null,null,null,null,null,null,""]
[1.07,"The Nexteer Supplier Packaging Information (SPI) Form is complete and submitted to the Nexteer Buyer with this quote. Note: The Nexteer approved SPI will need to be submitted with any future PPAPs, as required.",null,null,null,null,null,null,null,null,null,null,"Logistics",null,null,null,null,null,null,null,null,null,null,null,null,null,null,""]
[1.08,"There are no minimum order quantities required other than the standard pack size.",null,null,null,null,null,null,null,null,null,null,"Logistics",null,null,null,null,null,null,null,null,null,null,null,null,null,null,""]
[1.0900000000000001,"Supplier agrees to the Nexteer Standard terms to authorize suppliers to manufacture 2 weeks of material and procure/manufacture an additional 2 weeks of raw material/work-in-process (material authorization will total 4 weeks). All information beyond 4 weeks is for planning purposes only.  ",null,null,null,null,null,null,null,null,null,null,"Logistics",null,null,null,null,null,null,null,null,null,null,null,null,null,null,""]
[1.1000000000000001,"Supplier accepts to receive schedules electronically, through EDI (Electronic Data Interchange), Supplier Portal(s) or other electronic means. The supplier also commits to generate an Advance Shipping Notice (ASN) once the shipment has departed from the dock.",null,null,null,null,null,null,null,null,null,null,"Logistics",null,null,null,null,null,null,null,null,null,null,null,null,null,null,""]
[1.1100000000000001,"Supplier agrees to ship per the schedules and releases provided by Nexteer.",null,null,null,null,null,null,null,null,null,null,"Logistics",null,null,null,null,null,null,null,null,null,null,null,null,null,null,""]
[1.1200000000000001,"Supplier can meet the Nexteer Label specification available at https://www.nexteer.com/shipping-labeling-processes/.  A Sample label will be submitted for verification/approval with each PPAP submission.",null,null,null,null,null,null,null,null,null,null,"Logistics",null,null,null,null,null,null,null,"Link to Nexteer Label Requirements",null,null,null,null,null,null,""]
[1.1299999999999999,"The Supplier Manufacturing location planned to produce this part is IATF 16949 certified (if no, provide a timing plan on when certification will be achieved)",null,null,null,null,null,null,null,null,null,null,"Quality",null,null,null,null,null,null,null,null,null,null,null,null,null,null,{"$f":"IF(OR(ISBLANK(N15),ISBLANK(T15)),\"\",IF(AND(OR(N15=\"None\",N15=\"ISO9001 w/no plan\"),OR(ISBLANK(T15),T15=\"Open\")),\"R\",IF(OR(N15=\"ISO9001 w/app'd IATF plan\",N15=\"IATF16949\",T15=\"Closed & Approved\"),\"G\",\"Y\")))","v":""}]
[]
[null,null,{"$f":"COUNTIF(C20:C45,\"Yes\")","v":0},null,null,null,null,null,{"$f":"COUNTIF(I20:I24,\"Yes\")","v":0}]
["Applicable MCA Special Process Audits",null,null,null,null,null,"Applicable Continuous Quality Improvement Assessments",null,null,null,null,null,"Applicable Technical Supplements"]
["Special Process",null,"Applicable  (Y/N)",null,"Score",null,"Assessment",null,"Applicable  (Y/N)",null,"Score/ Complete",null,"Technical Supplement",null,"Applicable  (Y/N)","Status"]
["Aluminum Casting",null,{"$f":"IF(ISBLANK('1-Program Info'!L11),\"\",'1-Program Info'!L11)","v":"No"},null,null,null,"CQI-9 Heat Treat ",null,{"$f":"IF(ISBLANK('1-Program Info'!L46),\"\",'1-Program Info'!L46)","v":"No"},null,null,null,"Aluminum/Magnesium Casting",null,{"$f":"IF(ISBLANK('1-Program Info'!L11),\"\",'1-Program Info'!L11)","v":"No"},{"$f":"IF(ISBLANK(O20),\"\",IF(O20=\"Yes\",IF('1-Program Info'!U11=0,\"Complete\",\"Incomplete\"),\"\"))","v":""},"Diecast Aluminum & Magnesium"]
["Assembly Process",null,{"$f":"IF(ISBLANK('1-Program Info'!L12),\"\",'1-Program Info'!L12)","v":"No"},null,null,null,"CQI-11 Plating",null,{"$f":"IF(ISBLANK('1-Program Info'!L47),\"\",'1-Program Info'!L47)","v":"No"},null,null,null,"Coating & Plating",null,{"$f":"IF(AND(ISBLANK('1-Program Info'!L47),ISBLANK('1-Program Info'!L48)),\"\",IF(OR('1-Program Info'!L47=\"Yes\",'1-Program Info'!L48=\"Yes\"),\"Yes\",\"No\"))","v":"No"},{"$f":"IF(ISBLANK(O21),\"\",IF(O21=\"Yes\",IF('1-Program Info'!U48=0,\"Complete\",\"Incomplete\"),\"\"))","v":""}]
["Blow Molding",null,{"$f":"IF(ISBLANK('1-Program Info'!L13),\"\",'1-Program Info'!L13)","v":"No"},null,null,null,"CQI-12 Coatings",null,{"$f":"IF(ISBLANK('1-Program Info'!L48),\"\",'1-Program Info'!L48)","v":"No"},null,null,null,"Ductile Iron Casting",null,{"$f":"IF(ISBLANK('1-Program Info'!L14),\"\",'1-Program Info'!L14)","v":"No"},{"$f":"IF(ISBLANK(O22),\"\",IF(O22=\"Yes\",IF('1-Program Info'!U14=0,\"Complete\",\"Incomplete\"),\"\"))","v":""},"Ductile Iron"]
["Ductile Iron Casting",null,{"$f":"IF(ISBLANK('1-Program Info'!L14),\"\",'1-Program Info'!L14)","v":"No"},null,null,null,"CQI-15 Welding",null,{"$f":"IF(ISBLANK('1-Program Info'!L49),\"\",'1-Program Info'!L49)","v":"No"},null,null,null,"Electrical Product",null,{"$f":"IF(ISBLANK('1-Program Info'!L15),\"\",'1-Program Info'!L15)","v":"No"},{"$f":"IF(ISBLANK(O23),\"\",IF(O23=\"Yes\",IF('1-Program Info'!U15=0,\"Complete\",\"Incomplete\"),\"\"))","v":""},"Electrical"]
["Electrical Product",null,{"$f":"IF(ISBLANK('1-Program Info'!L15),\"\",'1-Program Info'!L15)","v":"No"},null,null,null,"CQI-17 Soldering",null,{"$f":"IF(ISBLANK('1-Program Info'!L50),\"\",'1-Program Info'!L50)","v":"No"},null,null,null,"Fasteners",null,{"$f":"IF(ISBLANK('1-Program Info'!L18),\"\",'1-Program Info'!L18)","v":"No"},{"$f":"IF(ISBLANK(O24),\"\",IF(O24=\"Yes\",IF('1-Program Info'!U18=0,\"Complete\",\"Incomplete\"),\"\"))","v":""},"Fastener"]
["ESD Protection",null,{"$f":"IF(ISBLANK('1-Program Info'!L16),\"\",'1-Program Info'!L16)","v":"No"},null,null,null,"CQI-23 Molding",null,{"$f":"IF(ISBLANK('1-Program Info'!L51),\"\",'1-Program Info'!L51)","v":"No"},null,null,null,"Forging",null,{"$f":"IF(ISBLANK('1-Program Info'!L19),\"\",'1-Program Info'!L19)","v":"No"},{"$f":"IF(ISBLANK(O25),\"\",IF(O25=\"Yes\",IF('1-Program Info'!U19=0,\"Complete\",\"Incomplete\"),\"\"))","v":""},"Forging"]
["Extrusion Process",null,{"$f":"IF(ISBLANK('1-Program Info'!L17),\"\",'1-Program Info'!L17)","v":"No"},null,null,null,"CQI-27 Casting",null,{"$f":"IF(ISBLANK('1-Program Info'!L52),\"\",'1-Program Info'!L52)","v":"No"},null,null,null,"Grey Iron",null,{"$f":"IF(ISBLANK('1-Program Info'!L20),\"\",'1-Program Info'!L20)","v":"No"},{"$f":"IF(ISBLANK(O26),\"\",IF(O26=\"Yes\",IF('1-Program Info'!U20=0,\"Complete\",\"Incomplete\"),\"\"))","v":""},"Grey Iron"]
["Fasteners",null,{"$f":"IF(ISBLANK('1-Program Info'!L18),\"\",'1-Program Info'!L18)","v":"No"},null,null,null,null,null,null,null,null,null,"Machined Part",null,{"$f":"IF(ISBLANK('1-Program Info'!L24),\"\",'1-Program Info'!L24)","v":"No"},{"$f":"IF(ISBLANK(O27),\"\",IF(O27=\"Yes\",IF('1-Program Info'!U24=0,\"Complete\",\"Incomplete\"),\"\"))","v":""},"Machined Part"]
["Forging",null,{"$f":"IF(ISBLANK('1-Program Info'!L19),\"\",'1-Program Info'!L19)","v":"No"},null,null,null,null,null,null,null,null,null,"Plastic Molding",null,{"$f":"IF(ISBLANK('1-Program Info'!L22),\"\",'1-Program Info'!L22)","v":"No"},{"$f":"IF(ISBLANK(O28),\"\",IF(O28=\"Yes\",IF('1-Program Info'!U22=0,\"Complete\",\"Incomplete\"),\"\"))","v":""},"Plastic Molding"]
["Grease Applicaton",null,{"$f":"IF(ISBLANK('1-Program Info'!L21),\"\",'1-Program Info'!L21)","v":"No"},null,null,null,null,null,null,null,null,null,"Powder Metal",null,{"$f":"IF(ISBLANK('1-Program Info'!L27),\"\",'1-Program Info'!L27)","v":"No"},{"$f":"IF(ISBLANK(O29),\"\",IF(O29=\"Yes\",IF('1-Program Info'!U27=0,\"Complete\",\"Incomplete\"),\"\"))","v":""},"Powdered Metal"]
["Injection Molding",null,{"$f":"IF(ISBLANK('1-Program Info'!L22),\"\",'1-Program Info'!L22)","v":"No"},null,null,null,null,null,null,null,null,null,"Press Fit",null,{"$f":"IF(ISBLANK('1-Program Info'!L28),\"\",'1-Program Info'!L28)","v":"No"},{"$f":"IF(ISBLANK(O30),\"\",IF(O30=\"Yes\",IF('1-Program Info'!U28=0,\"Complete\",\"Incomplete\"),\"\"))","v":""},"Press Fit"]
["I-shaft",null,{"$f":"IF(ISBLANK('1-Program Info'!L23),\"\",'1-Program Info'!L23)","v":"No"},null,null,null,null,null,null,null,null,null,"Projection Weld",null,{"$f":"IF(ISBLANK('1-Program Info'!L29),\"\",'1-Program Info'!L29)","v":"No"},{"$f":"IF(ISBLANK(O31),\"\",IF(O31=\"Yes\",IF('1-Program Info'!U29=0,\"Complete\",\"Incomplete\"),\"\"))","v":""},"Projection Welding"]
["Machining",null,{"$f":"IF(ISBLANK('1-Program Info'!L24),\"\",'1-Program Info'!L24)","v":"No"},null,null,null,null,null,null,null,null,null,"Rubber",null,{"$f":"IF(ISBLANK('1-Program Info'!L30),\"\",'1-Program Info'!L30)","v":"No"},{"$f":"IF(ISBLANK(O32),\"\",IF(O32=\"Yes\",IF('1-Program Info'!U30=0,\"Complete\",\"Incomplete\"),\"\"))","v":""},"Rubber"]
["Motor Assembly",null,{"$f":"IF(ISBLANK('1-Program Info'!L25),\"\",'1-Program Info'!L25)","v":"No"},null,null,null,null,null,null,null,null,null,"Springs",null,{"$f":"IF(ISBLANK('1-Program Info'!L32),\"\",'1-Program Info'!L32)","v":"No"},{"$f":"IF(ISBLANK(O33),\"\",IF(O33=\"Yes\",IF('1-Program Info'!U32=0,\"Complete\",\"Incomplete\"),\"\"))","v":""},"Squeeze Cast"]
["Painting Audit",null,{"$f":"IF(ISBLANK('1-Program Info'!L26),\"\",'1-Program Info'!L26)","v":"No"},null,null,null,null,null,null,null,null,null,"Squeeze Casting",null,{"$f":"IF(ISBLANK('1-Program Info'!L33),\"\",'1-Program Info'!L33)","v":"No"},{"$f":"IF(ISBLANK(O34),\"\",IF(O34=\"Yes\",IF('1-Program Info'!U33=0,\"Complete\",\"Incomplete\"),\"\"))","v":""},"Stamping 1 of 2"]
["Powered Metal",null,{"$f":"IF(ISBLANK('1-Program Info'!L27),\"\",'1-Program Info'!L27)","v":"No"},null,null,null,null,null,null,null,null,null,"Stamping 1 & 2",null,{"$f":"IF(ISBLANK('1-Program Info'!L34),\"\",'1-Program Info'!L34)","v":"No"},{"$f":"IF(ISBLANK(O35),\"\",IF(O35=\"Yes\",IF('1-Program Info'!U34=0,\"Complete\",\"Incomplete\"),\"\"))","v":""},"Steel Quality"]
["Rubber Bonding",null,{"$f":"IF(ISBLANK('1-Program Info'!L30),\"\",'1-Program Info'!L30)","v":"No"},null,null,null,null,null,null,null,null,null,"Steel Quality",null,{"$f":"IF(ISBLANK('1-Program Info'!L35),\"\",'1-Program Info'!L35)","v":"No"},{"$f":"IF(ISBLANK(O36),\"\",IF(O36=\"Yes\",IF('1-Program Info'!U35=0,\"Complete\",\"Incomplete\"),\"\"))","v":""},"Diecast Zinc"]
["Semiconductors",null,{"$f":"IF(ISBLANK('1-Program Info'!L31),\"\",'1-Program Info'!L31)","v":"No"},null,null,null,null,null,null,null,null,null,"Zinc Diecasting",null,{"$f":"IF(ISBLANK('1-Program Info'!L41),\"\",'1-Program Info'!L41)","v":"No"},{"$f":"IF(ISBLANK(O37),\"\",IF(O37=\"Yes\",IF('1-Program Info'!U41=0,\"Complete\",\"Incomplete\"),\"\"))","v":""}]
["Springs",null,{"$f":"IF(ISBLANK('1-Program Info'!L32),\"\",'1-Program Info'!L32)","v":"No"}]
["Stamping",null,{"$f":"IF(ISBLANK('1-Program Info'!L34),\"\",'1-Program Info'!L34)","v":"No"}]
["Steel Mill",null,{"$f":"IF(ISBLANK('1-Program Info'!L35),\"\",'1-Program Info'!L35)","v":"No"}]
["Threading",null,{"$f":"IF(ISBLANK('1-Program Info'!L36),\"\",'1-Program Info'!L36)","v":"No"}]
["Tapping",null,{"$f":"IF(ISBLANK('1-Program Info'!L37),\"\",'1-Program Info'!L37)","v":"No"}]
["Tie Rods",null,{"$f":"IF(ISBLANK('1-Program Info'!L38),\"\",'1-Program Info'!L38)","v":"No"}]
["Torque Control of Bolts",null,{"$f":"IF(ISBLANK('1-Program Info'!L39),\"\",'1-Program Info'!L39)","v":"No"}]
["Wafer Fabrication",null,{"$f":"IF(ISBLANK('1-Program Info'!L41),\"\",'1-Program Info'!L41)","v":"No"}]

{"sheet":"4-Technical Review","index":6,"n_rows":56,"n_cols":27,"rows_kept":56,"cut":false,"hidden":false,"merged":[[0,1,0,8]]}
[null,"Manufacturability Assessment and Process Plan - Technical Review",null,null,null,null,null,null,null,"Useful Links & Tips"]
[null,null,"TECHNICAL REVIEW\nCOMPLETED BY SUPPLIER FOR SUPPLIER CAPABILITY & SELECTION REVIEW","Category","Supplier Response","Additional Explanation or Comments","Mitigation Plan","Mitigation Plan Owner","Status\n(Nexteer AQE/SQE)","◄ See comments"]
["Required",1,"Do you understand ASME Y14.5 Geometric Dimensioning and Tolerancing (GD&T) standard?","Design",null,null,null,null,null,null,null,null,null,null,null,null,null,null,null,null,null,null,null,null,null,null,{"$f":"IF(OR(ISBLANK(E3),ISBLANK(I3)),\"\",IF(AND(E3=\"No\",OR(ISBLANK(I3),I3=\"Open\")),\"R\",IF(AND(E3=\"No\",I3=\"Mitigation Plan Approved\"),\"Y\",\"G\")))","v":""}]
["Required",1.1000000000000001,"Have you received the Design Severity & Sensitivity (DSS) document from Nexteer?","Design",null,null,null,null,null,null,null,null,null,null,null,null,null,null,null,null,null,null,null,null,null,null,""]
["Required",1.2,"Is the product adequately defined?  ","Design",null,null,null,null,null,null,null,null,null,null,null,null,null,null,null,null,null,null,null,null,null,null,""]
["Required",1.3,"Have all technical specifications and documents listed on the print been provided by Nexteer?","Design",null,null,null,null,null,null,null,null,null,null,null,null,null,null,null,null,null,null,null,null,null,null,""]
["Required",1.4,"Can all of the drawing dimensions/requirements and product/material specifications be achieved with the required CpK?","Design",null,null,null,null,null,null,null,null,null,null,null,null,null,null,null,null,null,null,null,null,null,null,""]
[null,1.5,"CpK studies will be provided at PPAP for all CL1, CL2, CL4, & CL5 DSS rated dimensions, unless identified on tab \"8-Process Controls\"","Design",null,null,null,null,null,null,null,null,null,null,null,null,null,null,null,null,null,null,null,null,null,null,""]
["Required",1.6,"Is your organization responsible for the design of this part?","Design",null,null,null,null,null,null,null,null,null,null,null,null,null,null,null,null,null,null,null,null,null,null,{"$f":"IF(OR(ISBLANK(E9),ISBLANK(I9)),\"\",IF(AND(OR(E9=\"Grey Box\",E9=\"Supplier Design\"),I9<>\"Closed\"),\"Y\",\"G\"))","v":""}]
["Conditional on 1.50",1.61,"Identify the design items for which your organization is responsible vs. the design items for which Nexteer is responsible.","Design","Comments Required",null,null,null,null,null,null,null,null,null,null,null,null,null,null,null,null,null,null,null,null,null,{"$f":"IF(E9<>\"Grey Box\",\"G\",IF(OR(ISBLANK(I10),I10=\"Open\"),\"R\",IF(I10=\"Closed\",\"G\",\"Y\")))","v":"G"}]
["Required",1.7,"Will material certificate(s) have the standard and grade matching what is on the drawing?  If not, Submit the \"Application Form of Material Substitution\" for approval","Design",null,null,null,null,null,"Application for alternate material subsitution",null,null,null,null,null,null,null,null,null,null,null,null,null,null,null,null,{"$f":"IF(OR(ISBLANK(E11),ISBLANK(I11)),\"\",IF(AND(E11=\"No\",OR(ISBLANK(I11),I11=\"Open\")),\"R\",IF(OR(AND(E11=\"Not Applicable\",I11<>\"Closed\"),AND(E11=\"No\",I11=\"Mitigation Plan Approved\")),\"Y\",\"G\")))","v":""}]
["Required",1.8,"Do you have any recommendations for improvements that may enhance the design, manufacturability, quality or value stream? If Yes, please explain","Design",null,null,null,null,null,null,null,null,null,null,null,null,null,null,null,null,null,null,null,null,null,null,{"$f":"IF(OR(ISBLANK(E12),ISBLANK(I12)),\"\",IF(AND(E12=\"Yes\",I12<>\"Closed\"),\"Y\",\"G\"))","v":""}]
["Required",1.9,"In the drawing block (in the lower right hand corner) is a template number populated? If no, contact your Nexteer Buyer immediately. Examples of template numbers: CISTMPxxxx, HSTMPxxx, EPSTMPxxx, HPSTMPxxx, HPSGTMPxxxx, etc.","Design",null,null,null,null,null,null,null,null,null,null,null,null,null,null,null,null,null,null,null,null,null,null,{"$f":"IF(OR(ISBLANK(E13),ISBLANK(I13)),\"\",IF(AND(E13=\"No\",OR(ISBLANK(I13),I13=\"Open\")),\"R\",IF(AND(E13=\"No\",I13=\"Mitigation Plan Approved\"),\"Y\",\"G\")))","v":""}]
["Required",2,"Is your manufacturing facility existing, requiring renovation, expanding, newly built, or Greenfield-under construction?","Manufacturing Facility",null,null,null,null,null,null,null,null,null,null,null,null,null,null,null,null,null,null,null,null,null,null,{"$f":"IF(OR(ISBLANK(E14),ISBLANK(I14)),\"\",IF(AND(OR(E14=\"New\",E14=\"Greenfield-under Construction\"),OR(ISBLANK(I14),I14=\"Open\")),\"R\",IF(OR(E14=\"Existing\",I14=\"Closed\"),\"G\",\"Y\")))","v":""}]
["Conditional on 2.00",2.0099999999999998,"How long has the facility been operating?","Manufacturing Facility",null,null,null,null,null,null,null,null,null,null,null,null,null,null,null,null,null,null,null,null,null,null,{"$f":"IF(E14<>\"Existing\",\"G\",IF(OR(ISBLANK(I15),I15=\"Open\"),\"R\",IF(I15=\"Closed\",\"G\",\"Y\")))","v":"G"}]
["Conditional on 2.00",2.02,"When will the 1st SOP begin?","Manufacturing Facility",null,null,null,null,null,null,null,null,null,null,null,null,null,null,null,null,null,null,null,null,null,null,{"$f":"IF(E14<>\"New\",\"G\",IF(OR(ISBLANK(I16),I16=\"Open\"),\"R\",IF(I16=\"Closed\",\"G\",\"Y\")))","v":"G"}]
["Conditional on 2.00",2.0299999999999998,"Provide milestones and timing on the construction & equipment set up","Manufacturing Facility",null,null,null,null,null,null,null,null,null,null,null,null,null,null,null,null,null,null,null,null,null,null,{"$f":"IF(E14<>\"Expansion Required\",\"G\",IF(OR(ISBLANK(I17),I17=\"Open\"),\"R\",IF(I17=\"Closed\",\"G\",\"Y\")))","v":"G"}]
["Conditional on 2.00",2.044,"Provide milestone timing on the Construction (Facility, equipment, staffing, etc…)","Manufacturing Facility",null,null,null,null,null,null,null,null,null,null,null,null,null,null,null,null,null,null,null,null,null,null,{"$f":"IF(E14<>\"Greenfield-under Construction\",\"G\",IF(OR(ISBLANK(I18),I18=\"Open\"),\"R\",IF(I18=\"Closed\",\"G\",\"Y\")))","v":"G"}]
["Required",2.1,"Will you have to hire additional staff to support this program?  If the answer is YES, document how many people.","Manufacturing Facility",null,null,null,null,null,null,null,null,null,null,null,null,null,null,null,null,null,null,null,null,null,null,{"$f":"IF(OR(ISBLANK(E19),ISBLANK(E19)),\"\",IF(AND(E19=\"Yes\",I19<>\"Closed\"),\"Y\",\"G\"))","v":""}]
["Required",2.2000000000000002,"Will all capital and tooling be in your final plant location(s) and your Sub-Suppliers at the time of PPAP submission? If answer is No, provide a copy of the proposed timing plan for the ramp up capacity","Manufacturing Facility",null,null,null,null,null,null,null,null,null,null,null,null,null,null,null,null,null,null,null,null,null,null,{"$f":"IF(OR(ISBLANK(E20),ISBLANK(I20)),\"\",IF(AND(E20=\"No\",OR(ISBLANK(I20),I20=\"Open\")),\"R\",IF(AND(E20=\"No\",I20=\"Mitigation Plan Approved\"),\"Y\",\"G\")))","v":""}]
["Pulled from 1-Program Info",3,"MCA & NSA have been completed (Score noted in comment section)","Quality System/Process",{"$f":"IF(ISBLANK('1-Program Info'!L3),\"\",'1-Program Info'!L3)","v":""},{"$f":"IF('1-Program Info'!L5=\"\",\"\",('1-Program Info'!L5)*100&\"%    \"&'1-Program Info'!M5)","v":""},null,null,null,null,null,null,null,null,null,null,null,null,null,null,null,null,null,null,null,null,{"$f":"IF(OR(ISBLANK('1-Program Info'!L3),ISBLANK(I21)),\"\",IF(AND(E21=\"No\",OR(ISBLANK(I21),I21=\"Open\")),\"R\",IF(AND(E21=\"No\",I21=\"Mitigation Plan Approved\"),\"Y\",\"G\")))","v":""}]
["Conditional on 3.00",3.01,"Has an MCA audit been scheduled?  If yes, please provide date","Quality System/Process",null,null,null,null,null,null,null,null,null,null,null,null,null,null,null,null,null,null,null,null,null,null,{"$f":"IF(AND(E21=\"No\",OR(ISBLANK(E22),ISBLANK(I22))),\"\",IF(AND(E22=\"No\",OR(ISBLANK(I22),I22=\"Open\")),\"R\",IF(AND(E22=\"No\",I22=\"Mitigation Plan Approved\"),\"Y\",\"G\")))","v":"G"}]
["Conditional on 3.00",3.02,"How many NSA elements are Red?  List the element & commitment Dates","Quality System/Process",null,null,null,null,null,null,null,null,null,null,null,null,null,null,null,null,null,null,null,null,null,null,{"$f":"IF(AND(E21=\"Yes\",OR(ISBLANK(E23),ISBLANK(I23))),\"\",IF(OR(E23=0,I23=\"Closed\"),\"G\",IF(AND(E23>3,OR(ISBLANK(I23),I23=\"Open\")),\"R\",\"Y\")))","v":"G"}]
["Conditional on 3.00",3.03,"How many MCA Required Special Process Action items are Red?  List the elements & commitment dates","Quality System/Process",null,null,null,null,null,null,null,null,null,null,null,null,null,null,null,null,null,null,null,null,null,null,{"$f":"IF(AND(E21=\"Yes\",OR(ISBLANK(E24),ISBLANK(I24))),\"\",IF(OR(E24=0,I24=\"Closed\"),\"G\",IF(AND(E24>3,OR(ISBLANK(I24),I24=\"Open\")),\"R\",\"Y\")))","v":"G"}]
["Conditional on 3.00",3.04,"How many Required CQI items \"Needs Immediate attention\".  List the elements that require \"Needs Immediate Attention\" & \"Needs Improvement\" and their respective commitment dates","Quality System/Process",null,null,null,null,null,null,null,null,null,null,null,null,null,null,null,null,null,null,null,null,null,null,{"$f":"IF(AND(E21=\"Yes\",OR(ISBLANK(E25),ISBLANK(I25))),\"\",IF(OR(E25=0,I25=\"Closed\"),\"G\",IF(AND(E25>3,OR(ISBLANK(I25),I25=\"Open\")),\"R\",\"Y\")))","v":"G"}]
["Required",3.1,"Are these parts similar to other products that you currently make in production?","Quality System/Process",null,null,null,null,null,null,null,null,null,null,null,null,null,null,null,null,null,null,null,null,null,null,{"$f":"IF(OR(ISBLANK(E26),ISBLANK(I26)),\"\",IF(AND(E26=\"No\",OR(ISBLANK(I26),I26=\"Open\")),\"R\",IF(OR(E26=\"Yes (on site today)\",I26=\"Closed\"),\"G\",\"Y\")))","v":""}]
["Conditional on 3.01",3.11,"Provide data (i.e.: capability studies) on similar parts that are in production for CL1, CL2, CL3, & CL4 dimension?","Quality System/Process","Comments Required",null,null,null,null,null,null,null,null,null,null,null,null,null,null,null,null,null,null,null,null,null,{"$f":"IF(E26=\"No\",\"G\",IF(ISBLANK(I27),\"\",IF(I27=\"Open\",\"R\",IF(I27=\"Closed\",\"G\",\"Y\"))))","v":""}]
["Required",3.2,"Do you understand SoC IMDS reporting requirements?","Quality System/Process",null,null,null,null,null,"Link to SoC Information",null,null,null,null,null,null,null,null,null,null,null,null,null,null,null,null,{"$f":"IF(OR(ISBLANK(E28),ISBLANK(I28)),\"\",IF(AND(E28=\"No\",OR(ISBLANK(I28),I28=\"Open\")),\"R\",IF(AND(E28=\"No\",I28=\"Mitigation Plan Approved\"),\"Y\",\"G\")))","v":""}]
["Required",3.3,"Have you presented a plan to close the open issues from the MCA prior to PPAP","Quality System/Process",null,null,null,null,null,null,null,null,null,null,null,null,null,null,null,null,null,null,null,null,null,null,{"$f":"IF('1-Program Info'!M5=\"Green\",\"G\",IF(OR(ISBLANK(E29),ISBLANK(I29)),\"\",IF(AND(E29=\"No Plan\",OR(ISBLANK(I29),I29=\"Open\")),\"R\",IF(OR(E29=\"Plan Approved\",I29=\"Closed\"),\"G\",\"Y\"))))","v":""}]
["Required",3.4,"Do you plan to rework or repair parts in production?  If yes, show in \"6-Process Flow Diagram\" tab","Quality System/Process",null,null,null,null,null,null,null,null,null,null,null,null,null,null,null,null,null,null,null,null,null,null,{"$f":"IF(OR(ISBLANK(E30),ISBLANK(I30)),\"\",IF(E30=\"No\",\"G\",IF(AND(E30=\"Yes\",OR(ISBLANK(I30),I30=\"Mitigation Plan Approved\")),\"Y\",IF(I30=\"Open\",\"R\",\"G\"))))","v":""}]
["Required",3.5,"Are there any Outsourced Operations? If yes, show outsourcing operation(s) on the \"6-Process Flow Diagram\" tab and the CL1-CL5 item(s) on the \"8-Process Controls\" tab","Quality System/Process",null,null,null,null,null,null,null,null,null,null,null,null,null,null,null,null,null,null,null,null,null,null,{"$f":"IF(OR(ISBLANK(E31),ISBLANK(I31)),\"\",IF(E31=\"No\",\"G\",IF(AND(E31=\"Yes\",OR(ISBLANK(I31),I31=\"Open\")),\"R\",\"Y\")))","v":""}]
["Conditional on 3.50",3.51,"Have the necessary CQI audits been performed for these outsourced operations?","Quality System/Process",null,null,null,null,null,null,null,null,null,null,null,null,null,null,null,null,null,null,null,null,null,null,{"$f":"IF(AND(E31=\"Yes\",OR(ISBLANK(E32),ISBLANK(I32))),\"\",IF(AND(E32=\"No\",OR(ISBLANK(I32),I32=\"Open\")),\"R\",IF(AND(E32=\"No\",I32=\"Mitigation Plan Approved\"),\"Y\",\"G\")))","v":"G"}]
["Required",4,"\"Yes\" the supplier can test the incoming material as received or \"No\" the material will have to be verified at an independent lab?","Raw Material",null,null,null,null,null,null,null,null,null,null,null,null,null,null,null,null,null,null,null,null,null,null,{"$f":"IF(OR(ISBLANK(E33),ISBLANK(I33)),\"\",IF(AND(E33=\"No\",OR(ISBLANK(I33),I33=\"Open\")),\"R\",IF(AND(E33=\"No\",I33=\"Mitigation Plan Approved\"),\"Y\",\"G\")))","v":""}]
["Required",4.0999999999999996,"Is the raw material standard material that you use in your plant?  ","Raw Material",null,null,null,null,null,null,null,null,null,null,null,null,null,null,null,null,null,null,null,null,null,null,{"$f":"IF(OR(ISBLANK(E34),ISBLANK(I34)),\"\",IF(AND(E34=\"No\",OR(ISBLANK(I34),I34=\"Open\")),\"R\",IF(AND(E34=\"No\",I34=\"Mitigation Plan Approved\"),\"Y\",\"G\")))","v":""}]
["Required",4.2,"What is the lead time for the material required?","Raw Material","Comments Required",null,null,null,null,null,null,null,null,null,null,null,null,null,null,null,null,null,null,null,null,null,{"$f":"IF(ISBLANK(I35),\"\",IF(I35=\"Open\",\"R\",IF(I35=\"Closed\",\"G\",\"Y\")))","v":""}]
["Required",4.3,"Do you validate the material at the work station?  If no, how do you ensure the correct material is used?","Raw Material",null,null,null,null,null,null,null,null,null,null,null,null,null,null,null,null,null,null,null,null,null,null,{"$f":"IF(OR(ISBLANK(E36),ISBLANK(I36)),\"\",IF(AND(E36=\"No\",OR(ISBLANK(I36),I36=\"Open\")),\"R\",IF(I36=\"Closed\",\"G\",\"Y\")))","v":""}]
["Required",5,"If applicable, how will the defined level of corrosion protection that is required be achieved?  Define/document the method.","Mfg Process",null,null,null,null,null,null,null,null,null,null,null,null,null,null,null,null,null,null,null,null,null,null,{"$f":"IF(OR(ISBLANK(E37),ISBLANK(I37)),\"\",IF(AND(E37=\"Not Applicable\",I37<>\"Closed\"),\"Y\",\"G\"))","v":""}]
["Required",5.0999999999999996,"Is a washing process required to meet contamination or surface preparation requirement?  If yes, please specify type of process & capability","Mfg Process",null,null,null,null,null,null,null,null,null,null,null,null,null,null,null,null,null,null,null,null,null,null,{"$f":"IF(OR(ISBLANK(E38),ISBLANK(I38)),\"\",IF(AND(E38=\"Yes\",I38<>\"Closed\"),\"Y\",\"G\"))","v":""}]
["Pulled from 1-Program Info",5.2,"Have ME lessons learned from the part development been shared with your organization?","Mfg Process",null,null,null,null,null,null,null,null,null,null,null,null,null,null,null,null,null,null,null,null,null,null,{"$f":"IF(OR(ISBLANK('1-Program Info'!D14),'1-Program Info'!D14=\"No\"),\"G\",IF(OR(ISBLANK(E39),ISBLANK(I39)),\"\",IF(AND(E39=\"No\",OR(ISBLANK(I39),I39=\"Open\")),\"R\",IF(AND(E39=\"No\",I39=\"Mitigation Plan Approved\"),\"Y\",\"G\"))))","v":"G"}]
["Pulled from 1-Program Info",5.3,"Have the: Work instructions, Process Flow Diagram, PFMEA, Control Plan, and fixture and gaging details been shared?","Mfg Process",null,null,null,null,null,null,null,null,null,null,null,null,null,null,null,null,null,null,null,null,null,null,{"$f":"IF(OR(ISBLANK('1-Program Info'!D14),'1-Program Info'!D14=\"No\"),\"G\",IF(OR(ISBLANK(E40),ISBLANK(I40)),\"\",IF(AND(E40=\"No\",OR(ISBLANK(I40),I40=\"Open\")),\"R\",IF(AND(E40=\"No\",I40=\"Mitigation Plan Approved\"),\"Y\",\"G\"))))","v":"G"}]
["Pulled from 1-Program Info",5.4,"Has an exit PPAP been provided?","Mfg Process",null,null,null,null,null,null,null,null,null,null,null,null,null,null,null,null,null,null,null,null,null,null,{"$f":"IF(OR(ISBLANK('1-Program Info'!D14),'1-Program Info'!D14=\"No\"),\"G\",IF(OR(ISBLANK(E41),ISBLANK(I41)),\"\",IF(AND(E41=\"No\",OR(ISBLANK(I41),I41=\"Open\")),\"R\",IF(OR(E41=\"Yes\",I41=\"Closed\"),\"G\",\"Y\"))))","v":"G"}]
["Required",6,"Is additonal Equipment required?  If yes, complete Equipment secton in \"5-Investment Timing\" tab.","Investment - Equipment",null,null,null,null,null,null,null,null,null,null,null,null,null,null,null,null,null,null,null,null,null,null,{"$f":"IF(OR(ISBLANK(E42),ISBLANK(I42)),\"\",IF(AND(E42=\"Yes\",I42<>\"Closed\"),\"Y\",\"G\"))","v":""}]
["Required",6.1,"Is part specific tooling required?  If yes, complete Tooling secton in \"5-Investment Timing\" tab","Investment - Tooling",null,null,null,null,null,null,null,null,null,null,null,null,null,null,null,null,null,null,null,null,null,null,{"$f":"IF(OR(ISBLANK(E43),ISBLANK(I43)),\"\",IF(AND(E43=\"Yes\",I43<>\"Closed\"),\"Y\",\"G\"))","v":""}]
["Required",6.2,"Are there Part specific gages required?  If yes, identify these special gages in the  \"5-Investment Timing\" tab.","Investment - Gages",null,null,null,null,null,null,null,null,null,null,null,null,null,null,null,null,null,null,null,null,null,null,{"$f":"IF(OR(ISBLANK(E44),ISBLANK(I44)),\"\",IF(AND(E44=\"Yes\",I44<>\"Closed\"),\"Y\",\"G\"))","v":""}]
["Required",6.3,"Are there part specific gages/fixtures that will need to be duplicated at your plant and at Nexteer in order to avoid potential measurement correlation issues?","Investment - Gages",null,null,null,null,null,null,null,null,null,null,null,null,null,null,null,null,null,null,null,null,null,null,{"$f":"IF(OR(ISBLANK(E45),ISBLANK(I45)),\"\",IF(AND(E45=\"Yes\",I45<>\"Closed\"),\"Y\",\"G\"))","v":""}]
[null,6.4,"Is a Zeiss CMM being used?","Investment - Gages",null,null,null,null,null,null,null,null,null,null,null,null,null,null,null,null,null,null,null,null,null,null,{"$f":"IF(OR(ISBLANK(E46),ISBLANK(I46)),\"\",IF(AND(E46=\"Yes\",I46<>\"Closed\"),\"Y\",\"G\"))","v":""}]
[null,6.41,"Who will be providing the Zeiss Program?","Investment - Gages",null,null,null,null,null,null,null,null,null,null,null,null,null,null,null,null,null,null,null,null,null,null,{"$f":"IF(AND(E46=\"Yes\",OR(ISBLANK(E47),ISBLANK(I47))),\"\",\"G\")","v":"G"}]
[null,6.42,"Who will be providing fixture/probes?","Investment - Gages",null,null,null,null,null,null,null,null,null,null,null,null,null,null,null,null,null,null,null,null,null,null,{"$f":"IF(AND(E46=\"Yes\",OR(ISBLANK(E48),ISBLANK(I48))),\"\",\"G\")","v":"G"}]
["Required",6.5,"Are any In-Line test Equipment / Fixtures required?  If yes, complete In-Line Test Equipement/Fixtures secton in \"5-Investment Timing\" tab.","Investment - Test Equipment",null,null,null,null,null,null,null,null,null,null,null,null,null,null,null,null,null,null,null,null,null,null,{"$f":"IF(OR(ISBLANK(E49),ISBLANK(I49)),\"\",IF(AND(E49=\"Yes\",I49<>\"Closed\"),\"Y\",\"G\"))","v":""}]
[null,6.6,"Is the supplier responsible for Design Validation (DV), Process Validation (PV) or Reliability testing?  If yes, complete Test Equipement secton in \"5-Investment Timing\" tab.","Investment - Test Equipment",null,null,null,null,null,null,null,null,null,null,null,null,null,null,null,null,null,null,null,null,null,null,{"$f":"IF(OR(ISBLANK(E50),ISBLANK(I50)),\"\",IF(AND(E50=\"Yes\",I50<>\"Closed\"),\"Y\",\"G\"))","v":""}]
["Required",7,"How will you supply prototoype samples?","Prototyping",null,null,null,null,null,null,null,null,null,null,null,null,null,null,null,null,null,null,null,null,null,null,{"$f":"IF(OR(ISBLANK(E51),ISBLANK(I51)),\"\",IF(AND(E51=\"Not Able to Supply\",OR(ISBLANK(I51),I51=\"Open\")),\"R\",IF(OR(E51=\"Mfg In House\",I51=\"Closed\"),\"G\",\"Y\")))","v":""}]
["Required",8,"Are you responsible for all raw material & sub component suppliers?","General",null,null,null,null,null,null,null,null,null,null,null,null,null,null,null,null,null,null,null,null,null,null,{"$f":"IF(OR(ISBLANK(E52),ISBLANK(I52)),\"\",IF(AND(E52=\"No\",OR(ISBLANK(I52),I52=\"Open\")),\"R\",IF(AND(E52=\"No\",I52=\"Mitigation Plan Approved\"),\"Y\",\"G\")))","v":""}]
[null,8.01,"State which parts & Suppliers you are not responsible for.","General",null,null,null,null,null,null,null,null,null,null,null,null,null,null,null,null,null,null,null,null,null,null,{"$f":"IF(E52=\"Yes\",\"G\",IF(OR(ISBLANK(E53),ISBLANK(I53)),\"\",IF(OR(ISBLANK(I53),I53=\"Open\"),\"R\",IF(I53=\"Mitigation Plan Approved\",\"Y\",\"G\"))))","v":""}]
["Required",8.1,"What percent of this manufacturing locations sales does this quoted business represent?","General",null,null,null,null,null,null,null,null,null,null,null,null,null,null,null,null,null,null,null,null,null,null,{"$f":"IF(OR(ISBLANK(E54),ISBLANK(I54)),\"\",IF(AND(OR(E54=\"30%-40%\",E54=\"40%-50%\",E54=\"50+%\"),OR(ISBLANK(I54),I54=\"Open\")),\"R\",IF(OR(E54=\"0%-5%\",E54=\"5%-10%\",E54=\"10%-20%\",I54=\"Closed\"),\"G\",\"Y\")))","v":""}]
["Required",8.1999999999999993,"Quantity of new part numbers currently launching besides this program.","General",null,null,null,null,null,null,null,null,null,null,null,null,null,null,null,null,null,null,null,null,null,null,{"$f":"IF(OR(ISBLANK(E55),ISBLANK(I55)),\"\",IF(OR(E55=0,I55=\"Closed\"),\"G\",IF(AND(E55>3,OR(ISBLANK(I55),I55=\"Open\")),\"R\",\"Y\")))","v":""}]
["Required",8.3000000000000007,"Are any new suppliers being used on this project: Raw material, Purchased components, Equipement/Machine suppliers, Tooling or Gage suppliers?  If yes, please specify.","General",null,null,null,null,null,null,null,null,null,null,null,null,null,null,null,null,null,null,null,null,null,null,{"$f":"IF(OR(ISBLANK(E56),ISBLANK(I56)),\"\",IF(AND(E56=\"Yes\",I56<>\"Closed\"),\"Y\",\"G\"))","v":""}]

{"sheet":"5-Investment Timing","index":7,"n_rows":106,"n_cols":14,"rows_kept":106,"cut":false,"hidden":false,"merged":[[105,10,105,13],[100,10,100,13],[101,10,101,13],[102,10,102,13],[103,10,103,13],[104,10,104,13],[95,10,95,13],[96,10,96,13],[97,10,97,13],[98,10,98,13],[99,10,99,13],[90,10,90,13],[91,10,91,13],[92,10,92,13],[93,10,93,13],[94,10,94,13],[85,10,85,13],[86,10,86,13],[87,10,87,13],[88,10,88,13],[89,10,89,13],[82,12,82,13],[83,12,83,13],[84,12,84,13],[77,12,77,13],[78,12,78,13],[79,12,79,13],[80,12,80,13],[81,12,81,13],[72,12,72,13],[73,12,73,13],[74,12,74,13],[75,12,75,13],[76,12,76,13],[67,12,67,13],[68,12,68,13],[69,12,69,13],[70,12,70,13],[71,12,71,13],[62,12,62,13],[63,12,63,13],[64,12,64,13],[65,12,65,13],[66,12,66,13],[57,12,57,13],[58,12,58,13],[59,12,59,13],[60,12,60,13],[61,12,61,13],[52,12,52,13],[53,12,53,13],[54,12,54,13],[55,12,55,13],[56,12,56,13],[47,12,47,13],[48,12,48,13],[49,12,49,13],[50,12,50,13],[51,12,51,13],[0,0,0,13],[43,12,43,13],[44,12,44,13],[45,12,45,13],[46,12,46,13]]}
["Manufacturability Assessment and Process Plan - Investment Timing"]
["Production Equipment \n& Inline Test Equipment","Quantity Required","Shared % / Dedicated","Existing / Refurbish / New","Equipment Built In House / Outsourced","Design \nLead-time (weeks)","Build \nLead-time (Weeks)","Trial / Debug Timing (Weeks)","Installation Timing (Weeks)","Integration Timing (Weeks)","Run Off Timing (Weeks)","Total \nLead-time (Weeks)","Is this a new supplier for Equipments","Comments"]
[null,null,null,null,null,null,null,null,null,null,null,{"$f":"+SUM(F3:K3)","v":0}]
[null,null,null,null,null,null,null,null,null,null,null,{"$f":"+SUM(F4:K4)","v":0}]
[null,null,null,null,null,null,null,null,null,null,null,{"$f":"+SUM(F5:K5)","v":0}]
[null,null,null,null,null,null,null,null,null,null,null,0]
[null,null,null,null,null,null,null,null,null,null,null,0]
[null,null,null,null,null,null,null,null,null,null,null,0]
[null,null,null,null,null,null,null,null,null,null,null,{"$f":"+SUM(F9:K9)","v":0}]
[null,null,null,null,null,null,null,null,null,null,null,{"$f":"+SUM(F10:K10)","v":0}]
[null,null,null,null,null,null,null,null,null,null,null,0]
[null,null,null,null,null,null,null,null,null,null,null,0]
[null,null,null,null,null,null,null,null,null,null,null,0]
[null,null,null,null,null,null,null,null,null,null,null,{"$f":"+SUM(F14:K14)","v":0}]
[null,null,null,null,null,null,null,null,null,null,null,0]
[null,null,null,null,null,null,null,null,null,null,null,0]
[null,null,null,null,null,null,null,null,null,null,null,{"$f":"+SUM(F17:K17)","v":0}]
[null,null,null,null,null,null,null,null,null,null,null,0]
[null,null,null,null,null,null,null,null,null,null,null,0]
[null,null,null,null,null,null,null,null,null,null,null,0]
[null,null,null,null,null,null,null,null,null,null,null,0]
[null,null,null,null,null,null,null,null,null,null,null,0]
["Tooling & Fixtures",{"$f":"B2","v":"Quantity Required"},"Shared % / Dedicated","Existing / Refurbish / New","Tooling Built In House / Outsourced","Design \nLead-time (weeks)","Build \nLead-time (Weeks)","Trial / Debug Timing (Weeks)","Installation Timing (Weeks)","Integration Timing (Weeks)","Run Off Timing (Weeks)","Total \nLead-time (Weeks)","Number of Grooming loops / Tooling Trials","Comments"]
[null,null,null,null,null,null,null,null,null,null,null,{"$f":"+SUM(F24:K24)","v":0}]
[null,null,null,null,null,null,null,null,null,null,null,0]
[null,null,null,null,null,null,null,null,null,null,null,0]
[null,null,null,null,null,null,null,null,null,null,null,{"$f":"+SUM(F27:K27)","v":0}]
[null,null,null,null,null,null,null,null,null,null,null,0]
[null,null,null,null,null,null,null,null,null,null,null,0]
[null,null,null,null,null,null,null,null,null,null,null,0]
[null,null,null,null,null,null,null,null,null,null,null,0]
[null,null,null,null,null,null,null,null,null,null,null,0]
[null,null,null,null,null,null,null,null,null,null,null,0]
[null,null,null,null,null,null,null,null,null,null,null,0]
[null,null,null,null,null,null,null,null,null,null,null,0]
[null,null,null,null,null,null,null,null,null,null,null,0]
[null,null,null,null,null,null,null,null,null,null,null,0]
[null,null,null,null,null,null,null,null,null,null,null,{"$f":"+SUM(F38:K38)","v":0}]
[null,null,null,null,null,null,null,null,null,null,null,0]
[null,null,null,null,null,null,null,null,null,null,null,0]
[null,null,null,null,null,null,null,null,null,null,null,0]
[null,null,null,null,null,null,null,null,null,null,null,0]
[null,null,null,null,null,null,null,null,null,null,null,0]
["Special Gages",{"$f":"B23","v":"Quantity Required"},"Shared % / Dedicated","Existing / Refurbish / New","Gauges Built In House / Outsourced","Design \nLead-time (weeks)","Build \nLead-time (Weeks)","Trial / Debug Timing (Weeks)","Installation Timing (Weeks)","Integration Timing (Weeks)","Run Off Timing (Weeks)","Total \nLead-time (Weeks)","Comments"]
[null,null,null,null,null,null,null,null,null,null,null,{"$f":"+SUM(F45:K45)","v":0}]
[null,null,null,null,null,null,null,null,null,null,null,{"$f":"+SUM(F46:K46)","v":0}]
[null,null,null,null,null,null,null,null,null,null,null,{"$f":"+SUM(F47:K47)","v":0}]
[null,null,null,null,null,null,null,null,null,null,null,0]
[null,null,null,null,null,null,null,null,null,null,null,0]
[null,null,null,null,null,null,null,null,null,null,null,0]
[null,null,null,null,null,null,null,null,null,null,null,0]
[null,null,null,null,null,null,null,null,null,null,null,0]
[null,null,null,null,null,null,null,null,null,null,null,0]
[null,null,null,null,null,null,null,null,null,null,null,0]
[null,null,null,null,null,null,null,null,null,null,null,0]
[null,null,null,null,null,null,null,null,null,null,null,0]
[null,null,null,null,null,null,null,null,null,null,null,0]
[null,null,null,null,null,null,null,null,null,null,null,{"$f":"+SUM(F58:K58)","v":0}]
[null,null,null,null,null,null,null,null,null,null,null,0]
[null,null,null,null,null,null,null,null,null,null,null,0]
[null,null,null,null,null,null,null,null,null,null,null,0]
[null,null,null,null,null,null,null,null,null,null,null,0]
[null,null,null,null,null,null,null,null,null,null,null,0]
[null,null,null,null,null,null,null,null,null,null,null,0]
["DV or PV Testing Equipment / Fixtures",{"$f":"B44","v":"Quantity Required"},"Shared % / Dedicated","Existing / Refurbish / New","Equipment Built In House / Outsourced","Design \nLead-time (weeks)","Build \nLead-time (Weeks)","Trial / Debug Timing (Weeks)","Installation Timing (Weeks)","Integration Timing (Weeks)","Run Off Timing (Weeks)","Total \nLead-time (Weeks)","Comments"]
[null,null,null,null,null,null,null,null,null,null,null,{"$f":"+SUM(F66:K66)","v":0}]
[null,null,null,null,null,null,null,null,null,null,null,0]
[null,null,null,null,null,null,null,null,null,null,null,0]
[null,null,null,null,null,null,null,null,null,null,null,{"$f":"+SUM(F69:K69)","v":0}]
[null,null,null,null,null,null,null,null,null,null,null,0]
[null,null,null,null,null,null,null,null,null,null,null,0]
[null,null,null,null,null,null,null,null,null,null,null,0]
[null,null,null,null,null,null,null,null,null,null,null,0]
[null,null,null,null,null,null,null,null,null,null,null,0]
[null,null,null,null,null,null,null,null,null,null,null,{"$f":"+SUM(F75:K75)","v":0}]
[null,null,null,null,null,null,null,null,null,null,null,0]
[null,null,null,null,null,null,null,null,null,null,null,0]
[null,null,null,null,null,null,null,null,null,null,null,0]
[null,null,null,null,null,null,null,null,null,null,null,{"$f":"+SUM(F79:K79)","v":0}]
[null,null,null,null,null,null,null,null,null,null,null,{"$f":"+SUM(F80:K80)","v":0}]
[null,null,null,null,null,null,null,null,null,null,null,0]
[null,null,null,null,null,null,null,null,null,null,null,0]
[null,null,null,null,null,null,null,null,null,null,null,0]
[null,null,null,null,null,null,null,null,null,null,null,0]
[null,null,null,null,null,null,null,null,null,null,null,0]
["Facility Investment",{"$f":"B65","v":"Quantity Required"},"Upgrade / New","Equipment Built In House / Outsourced",{"$f":"F65","v":"Design \nLead-time (weeks)"},{"$f":"G65","v":"Build \nLead-time (Weeks)"},{"$f":"I65","v":"Installation Timing (Weeks)"},{"$f":"H65","v":"Trial / Debug Timing (Weeks)"},{"$f":"K65","v":"Run Off Timing (Weeks)"},{"$f":"L65","v":"Total \nLead-time (Weeks)"},"Comments"]
[null,null,null,null,null,null,null,null,null,{"$f":"+SUM(E87:I87)","v":0}]
[null,null,null,null,null,null,null,null,null,0]
[null,null,null,null,null,null,null,null,null,0]
[null,null,null,null,null,null,null,null,null,0]
[null,null,null,null,null,null,null,null,null,0]
[null,null,null,null,null,null,null,null,null,0]
[null,null,null,null,null,null,null,null,null,0]
[null,null,null,null,null,null,null,null,null,0]
[null,null,null,null,null,null,null,null,null,0]
[null,null,null,null,null,null,null,null,null,0]
[null,null,null,null,null,null,null,null,null,0]
[null,null,null,null,null,null,null,null,null,0]
[null,null,null,null,null,null,null,null,null,0]
[null,null,null,null,null,null,null,null,null,0]
[null,null,null,null,null,null,null,null,null,0]
[null,null,null,null,null,null,null,null,null,0]
[null,null,null,null,null,null,null,null,null,0]
[null,null,null,null,null,null,null,null,null,0]
[null,null,null,null,null,null,null,null,null,0]
[null,null,null,null,null,null,null,null,null,0]

{"sheet":"6-Process Flow Diagram","index":8,"n_rows":14,"n_cols":4,"rows_kept":14,"cut":false,"hidden":false,"merged":[[1,1,11,1],[0,0,0,3],[13,0,13,1]]}
["Manufacturability Assessment and Process Plan - Process Flow Diagram"]
[null,"After reviewing the Process Flow, are there any special Processes, CQI Audits, or Technical Supplements that were not already addressed & Documented?",null,"List of all Applicable Processes entered on Supplier Feasibility tab"]
["Items to be documented in Process Flow Diagram",null,null,"Applicable Special Processes"]
["2) Each Process station / Piece of equipment"]
["3) Material Handling approach between process station",null,null,"Applicable CQI Processes"]
["4) Equipment"]
["5) Rework or re-test loops",null,null,"Applicable Technical Supplements"]
["6) Incoming inspection"]
["7) Packing"]
["8) Outsourced Operations - Material handling, supplier, incoming inspection"]
["9) Material Storage in material flow"]
["10) Inspection stations"]
[]
["Paste a copy of the Process Flow Diagram or attach a PDF copy of the Process Flow Diagram below:"]

{"sheet":"7-Capacity Plan","index":9,"n_rows":40,"n_cols":45,"rows_kept":40,"cut":false,"hidden":false,"merged":[[20,3,20,6],[21,3,21,6],[22,3,22,6],[23,3,23,6],[24,3,24,6],[25,3,25,6],[26,3,26,6],[27,3,27,6],[28,3,28,6],[29,3,29,6],[37,3,37,6],[38,3,38,6],[39,3,39,6],[30,3,30,6],[31,3,31,6],[32,3,32,6],[33,3,33,6],[34,3,34,6],[35,3,35,6],[36,3,36,6],[16,3,16,6],[17,3,17,6],[18,3,18,6],[19,3,19,6],[12,3,12,6],[13,3,13,6],[14,3,14,6],[15,3,15,6],[0,0,0,35],[7,2,7,6],[10,3,10,6],[11,3,11,6],[4,31,4,32],[5,31,5,32],[2,16,2,19],[4,16,4,19],[2,14,2,15],[2,1,2,5],[4,1,4,5],[2,7,2,10],[4,7,4,10],[4,14,4,15]]}
["Manufacturability Assessment and Process Plan - Capacity Plan"]
[null,null,null,null,null,null,null,null,null,null,null,null,null,null,null,null,null,null,null,null,null,null,null,null,null,null,null,null,null,"Production days at Nexteer Automotive (days/yr):  ",null,{"$f":"'1-Program Info'!B21","v":240}]
[null,"Part Description:",null,null,null,null,null,{"$f":"'1-Program Info'!B3","v":"[Enter Part Name Here]"},null,null,null,null,null,null,"Drwg Rev:",null,{"$f":"'1-Program Info'!B7","v":"[Enter Drwg Rev Here]"},null,null,null,null,null,null,null,null,null,null,null,null,"Production days at Supplier (days/yr):  "]
[]
[null,"Part  Number:",null,null,null,null,null,{"$f":"'1-Program Info'!B5","v":"[Enter PN Here]"},null,null,null,null,null,null,"Supplier Name:",null,{"$f":"'2-Supplier Information'!B3","v":"[Enter Supplier Name Here]"}]
[null,null,null,null,null,null,null,null,null,null,null,null,null,null,null,null,null,null,null,null,null,null,null,null,null,null,null,null,null,"Maximum Scheduled Volumes (MSV):  ",null,{"$f":"IF('1-Program Info'!B17=\"[Enter LCR]\",\"See Program Tab\",'1-Program Info'!B17)","v":"See Program Tab"}]
[]
["Number of Identical Machines","Op Number","Process Name:  List each separate production line or machine",null,null,null,null,"Operators per shift","shifts / day","hours / shift","days / wk","Planned Cycle Time (sec)","parts / cycle","Daily Process Capacity","Scheduled breaks & lunch per shift (min)","Planned Tool change time per shift (min)","Planned Changeover time per shift (min)","Other planned downtime per shift (min)","Historical unscheduled downtime per shift (min)","Planned % up time","Planned % scrap at this process operation","% scrap parts per operation ","Calculation Colum","Sum of all down stream operations scrap rate %'s","Planned Daily Capacity","Machine loading allocated for other parts","Column for Opening Extended R@R","Hours per week allocated for this part","Planned Daily Capacity with allocation","Daily MSV ","Overall required OEE","Daily Quoted Tool Capacity","Planned Weekly Capacity Allocated to this Part","Annual Capacity","Weekly MSV","Annual MSV","Constraint on MSV?","OEE For 15% Above MSV","15% above Daily MSV","15% above Weekly MSV","15% above Yearly MSV","Constraint on 15% above MSV?","Net Good Parts / hour","Production time used for MSV (hrs/wk)","Production time used for 15% above MSV (hrs/wk)"]
[]
[]
[{"$f":"COUNTIF($B$11:$B$40,B11)","v":0},null,1,null,null,null,null,null,null,null,null,null,null,{"$f":"IFERROR(((I11*(J11-((O11+R11)/60))*3600)/L11)*M11,\"\")","v":""},null,null,null,null,null,{"$f":"IFERROR(1-(P11+Q11+S11)/(J11*60-(O11+R11)),\"\")","v":""},null,{"$f":"IFERROR(SUMIF(B$11:B$40,B11,U$11:U$40)/A11,\"\")","v":""},{"$f":"IF(B12=0,V11,IF(B11<B12,(SUMIF(B$11:B$40,B11,V$11:V$40)/A11)+W12,W12))","v":""},{"$f":"$W11","v":""},{"$f":"IF(T11=\"\",\"\",ROUNDUP(N11*(1-X11)*T11,0))","v":""},null,{"$f":"IF(A11=1,IF(Z11>=0.5,1,0),0)","v":0},{"$f":"IF(H11=\"\",\"\",I11*(1-Z11)*K11*(J11-((O11+R11)/60)))","v":""},{"$f":"IFERROR(IF(Y11*(1-Z11)=0,\"\",ROUNDUP(Y11*(1-Z11),0)),\"\")","v":""},{"$f":"(IFERROR(ROUNDUP(AC11/SUMIF($B$11:$B$40,B11,$AC$11:$AC$40)*$AF$11,),\"\"))","v":""},{"$f":"IFERROR(ROUNDUP(AD11/AC11,4),\"\")","v":""},{"$f":"IF(K11=\"\",\"\",IF('1-Program Info'!$B$19=\"[Calculated Field]\",0/$AF$2,$AF$6/$AF$2))","v":""},{"$f":"IFERROR(IF(K11=\"\",\"\",AC11*K11),\"\")","v":""},{"$f":"IF(J11=\"\",\"\",$S$10*AD11)","v":""},{"$f":"IFERROR(IF(K11=\"\",\"\",AD11*K11),\"\")","v":""},{"$f":"IFERROR(IF(A11=1,$AF$6,AD11*240),\"\")","v":""},{"$f":"IF(J11=\"\",\"\",IF(AE11<1,\"NO\",\"YES\"))","v":""},{"$f":"IFERROR(AM11/AC11,\"\")","v":""},{"$f":"IFERROR(IF(AD11*1.15=0,\"\",ROUNDUP(AD11*1.15,0)),\"\")","v":""},{"$f":"IFERROR(IF(K11=\"\",\"\",AM11*K11),\"\")","v":""},{"$f":"IF(AJ11=\"\",\"\",AJ11*1.15)","v":""},{"$f":"IF(J11=\"\",\"\",IF(AL11>1.2,\"YES\",IF(AL11>1,\"HR\",IF(AL11<1,\"No\",IF(AL11=1.001,\"\",\"NO\")))))","v":""},{"$f":"IF(J11=\"\",\"\",(3600/L11)*M11*(1-X11)*T11)","v":""},{"$f":"IFERROR(AE11*AB11,\"\")","v":""},{"$f":"IFERROR(AB11*AE11*1.15,\"\")","v":""}]
[{"$f":"COUNTIF($B$11:$B$40,B12)","v":0},null,2,null,null,null,null,null,null,null,null,null,null,{"$f":"IFERROR(((I12*(J12-((O12+R12)/60))*3600)/L12)*M12,\"\")","v":""},null,null,null,null,null,{"$f":"IFERROR(1-(P12+Q12+S12)/(J12*60-(O12+R12)),\"\")","v":""},null,{"$f":"IFERROR(SUMIF(B$11:B$40,B12,U$11:U$40)/A12,\"\")","v":""},{"$f":"IF(B13=0,V12,IF(B12<B13,(SUMIF(B$11:B$40,B12,V$11:V$40)/A12)+W13,W13))","v":""},"",{"$f":"IF(T12=\"\",\"\",ROUNDUP(N12*(1-X12)*T12,0))","v":""},null,0,{"$f":"IF(H12=\"\",\"\",I12*(1-Z12)*K12*(J12-((O12+R12)/60)))","v":""},"",{"$f":"(IFERROR(ROUNDUP(AC12/SUMIF($B$11:$B$40,B12,$AC$11:$AC$40)*$AF$11,),\"\"))","v":""},{"$f":"IFERROR(ROUNDUP(AD12/AC12,4),\"\")","v":""},{"$f":"IF(K12=\"\",\"\",IF('1-Program Info'!$B$19=\"[Calculated Field]\",0/$AF$2,$AF$6/$AF$2))","v":""},"",{"$f":"IF(J12=\"\",\"\",$S$10*AD12)","v":""},"",{"$f":"IFERROR(IF(A12=1,$AF$6,AD12*240),\"\")","v":""},"",{"$f":"IFERROR(AM12/AC12,\"\")","v":""},{"$f":"IFERROR(IF(AD12*1.15=0,\"\",ROUNDUP(AD12*1.15,0)),\"\")","v":""},"",{"$f":"IF(AJ12=\"\",\"\",AJ12*1.15)","v":""},"",{"$f":"IF(J12=\"\",\"\",(3600/L12)*M12*(1-X12)*T12)","v":""},{"$f":"IFERROR(AE12*AB12,\"\")","v":""},{"$f":"IFERROR(AB12*AE12*1.15,\"\")","v":""}]
[0,null,3,null,null,null,null,null,null,null,null,null,null,"",null,null,null,null,null,"",null,"","","","",null,0,"","","","",{"$f":"IF(K13=\"\",\"\",IF('1-Program Info'!$B$19=\"[Calculated Field]\",0/$AF$2,$AF$6/$AF$2))","v":""},"","","","","","","","","","","","",""]
[0,null,4,null,null,null,null,null,null,null,null,null,null,"",null,null,null,null,null,"",null,"","","","",null,0,"","","","",{"$f":"IF(K14=\"\",\"\",IF('1-Program Info'!$B$19=\"[Calculated Field]\",0/$AF$2,$AF$6/$AF$2))","v":""},"","","","","","","","","","","","",""]
[0,null,5,null,null,null,null,null,null,null,null,null,null,"",null,null,null,null,null,"",null,"","","","",null,0,"","","","",{"$f":"IF(K15=\"\",\"\",IF('1-Program Info'!$B$19=\"[Calculated Field]\",0/$AF$2,$AF$6/$AF$2))","v":""},"","","","","","","","","","","","",""]
[0,null,6,null,null,null,null,null,null,null,null,null,null,"",null,null,null,null,null,"",null,"","","","",null,0,"","","","",{"$f":"IF(K16=\"\",\"\",IF('1-Program Info'!$B$19=\"[Calculated Field]\",0/$AF$2,$AF$6/$AF$2))","v":""},"","","","","","","","","","","","",""]
[0,null,7,null,null,null,null,null,null,null,null,null,null,"",null,null,null,null,null,"",null,"","","","",null,0,"","","","",{"$f":"IF(K17=\"\",\"\",IF('1-Program Info'!$B$19=\"[Calculated Field]\",0/$AF$2,$AF$6/$AF$2))","v":""},"","","","","","","","","","","","",""]
[0,null,8,null,null,null,null,null,null,null,null,null,null,"",null,null,null,null,null,"",null,"","","","",null,0,"","","","",{"$f":"IF(K18=\"\",\"\",IF('1-Program Info'!$B$19=\"[Calculated Field]\",0/$AF$2,$AF$6/$AF$2))","v":""},"","","","","","","","","","","","",""]
[0,null,9,null,null,null,null,null,null,null,null,null,null,"",null,null,null,null,null,"",null,"","","","",null,0,"","","","",{"$f":"IF(K19=\"\",\"\",IF('1-Program Info'!$B$19=\"[Calculated Field]\",0/$AF$2,$AF$6/$AF$2))","v":""},"","","","","","","","","","","","",""]
[0,null,10,null,null,null,null,null,null,null,null,null,null,"",null,null,null,null,null,"",null,"","","","",null,0,"","","","",{"$f":"IF(K20=\"\",\"\",IF('1-Program Info'!$B$19=\"[Calculated Field]\",0/$AF$2,$AF$6/$AF$2))","v":""},"","","","","","","","","","","","",""]
[0,null,11,null,null,null,null,null,null,null,null,null,null,"",null,null,null,null,null,"",null,"","","","",null,0,"","","","",{"$f":"IF(K21=\"\",\"\",IF('1-Program Info'!$B$19=\"[Calculated Field]\",0/$AF$2,$AF$6/$AF$2))","v":""},"","","","","","","","","","","","",""]
[0,null,12,null,null,null,null,null,null,null,null,null,null,"",null,null,null,null,null,"",null,"","","","",null,0,"","","","",{"$f":"IF(K22=\"\",\"\",IF('1-Program Info'!$B$19=\"[Calculated Field]\",0/$AF$2,$AF$6/$AF$2))","v":""},"","","","","","","","","","","","",""]
[0,null,13,null,null,null,null,null,null,null,null,null,null,"",null,null,null,null,null,"",null,"","","","",null,0,"","","","",{"$f":"IF(K23=\"\",\"\",IF('1-Program Info'!$B$19=\"[Calculated Field]\",0/$AF$2,$AF$6/$AF$2))","v":""},"","","","","","","","","","","","",""]
[0,null,14,null,null,null,null,null,null,null,null,null,null,"",null,null,null,null,null,"",null,"","","","",null,0,"","","","",{"$f":"IF(K24=\"\",\"\",IF('1-Program Info'!$B$19=\"[Calculated Field]\",0/$AF$2,$AF$6/$AF$2))","v":""},"","","","","","","","","","","","",""]
[0,null,15,null,null,null,null,null,null,null,null,null,null,"",null,null,null,null,null,"",null,"","","","",null,0,"","","","",{"$f":"IF(K25=\"\",\"\",IF('1-Program Info'!$B$19=\"[Calculated Field]\",0/$AF$2,$AF$6/$AF$2))","v":""},"","","","","","","","","","","","",""]
[0,null,16,null,null,null,null,null,null,null,null,null,null,"",null,null,null,null,null,"",null,"","","","",null,0,"","","","",{"$f":"IF(K26=\"\",\"\",IF('1-Program Info'!$B$19=\"[Calculated Field]\",0/$AF$2,$AF$6/$AF$2))","v":""},"","","","","","","","","","","","",""]
[0,null,17,null,null,null,null,null,null,null,null,null,null,"",null,null,null,null,null,"",null,"","","","",null,0,"","","","",{"$f":"IF(K27=\"\",\"\",IF('1-Program Info'!$B$19=\"[Calculated Field]\",0/$AF$2,$AF$6/$AF$2))","v":""},"","","","","","","","","","","","",""]
[0,null,18,null,null,null,null,null,null,null,null,null,null,"",null,null,null,null,null,"",null,"","","","",null,0,"","","","",{"$f":"IF(K28=\"\",\"\",IF('1-Program Info'!$B$19=\"[Calculated Field]\",0/$AF$2,$AF$6/$AF$2))","v":""},"","","","","","","","","","","","",""]
[0,null,19,null,null,null,null,null,null,null,null,null,null,"",null,null,null,null,null,"",null,"","","","",null,0,"","","","",{"$f":"IF(K29=\"\",\"\",IF('1-Program Info'!$B$19=\"[Calculated Field]\",0/$AF$2,$AF$6/$AF$2))","v":""},"","","","","","","","","","","","",""]
[0,null,20,null,null,null,null,null,null,null,null,null,null,"",null,null,null,null,null,"",null,"","","","",null,0,"","","","",{"$f":"IF(K30=\"\",\"\",IF('1-Program Info'!$B$19=\"[Calculated Field]\",0/$AF$2,$AF$6/$AF$2))","v":""},"","","","","","","","","","","","",""]
[0,null,21,null,null,null,null,null,null,null,null,null,null,"",null,null,null,null,null,"",null,"","","","",null,0,"","","","",{"$f":"IF(K31=\"\",\"\",IF('1-Program Info'!$B$19=\"[Calculated Field]\",0/$AF$2,$AF$6/$AF$2))","v":""},"","","","","","","","","","","","",""]
[0,null,22,null,null,null,null,null,null,null,null,null,null,"",null,null,null,null,null,"",null,"","","","",null,0,"","","","",{"$f":"IF(K32=\"\",\"\",IF('1-Program Info'!$B$19=\"[Calculated Field]\",0/$AF$2,$AF$6/$AF$2))","v":""},"","","","","","","","","","","","",""]
[0,null,23,null,null,null,null,null,null,null,null,null,null,"",null,null,null,null,null,"",null,"","","","",null,0,"","","","",{"$f":"IF(K33=\"\",\"\",IF('1-Program Info'!$B$19=\"[Calculated Field]\",0/$AF$2,$AF$6/$AF$2))","v":""},"","","","","","","","","","","","",""]
[0,null,24,null,null,null,null,null,null,null,null,null,null,"",null,null,null,null,null,"",null,"","","","",null,0,"","","","",{"$f":"IF(K34=\"\",\"\",IF('1-Program Info'!$B$19=\"[Calculated Field]\",0/$AF$2,$AF$6/$AF$2))","v":""},"","","","","","","","","","","","",""]
[0,null,25,null,null,null,null,null,null,null,null,null,null,"",null,null,null,null,null,"",null,"","","","",null,0,"","","","",{"$f":"IF(K35=\"\",\"\",IF('1-Program Info'!$B$19=\"[Calculated Field]\",0/$AF$2,$AF$6/$AF$2))","v":""},"","","","","","","","","","","","",""]
[0,null,26,null,null,null,null,null,null,null,null,null,null,"",null,null,null,null,null,"",null,"","","","",null,0,"","","","",{"$f":"IF(K36=\"\",\"\",IF('1-Program Info'!$B$19=\"[Calculated Field]\",0/$AF$2,$AF$6/$AF$2))","v":""},"","","","","","","","","","","","",""]
[0,null,27,null,null,null,null,null,null,null,null,null,null,"",null,null,null,null,null,"",null,"","","","",null,0,"","","","",{"$f":"IF(K37=\"\",\"\",IF('1-Program Info'!$B$19=\"[Calculated Field]\",0/$AF$2,$AF$6/$AF$2))","v":""},"","","","","","","","","","","","",""]
[0,null,28,null,null,null,null,null,null,null,null,null,null,"",null,null,null,null,null,"",null,"","","","",null,0,"","","","",{"$f":"IF(K38=\"\",\"\",IF('1-Program Info'!$B$19=\"[Calculated Field]\",0/$AF$2,$AF$6/$AF$2))","v":""},"","","","","","","","","","","","",""]
[0,null,29,null,null,null,null,null,null,null,null,null,null,"",null,null,null,null,null,"",null,"","","","",null,0,"","","","",{"$f":"IF(K39=\"\",\"\",IF('1-Program Info'!$B$19=\"[Calculated Field]\",0/$AF$2,$AF$6/$AF$2))","v":""},"","","","","","","","","","","","",""]
[0,null,30,null,null,null,null,null,null,null,null,null,null,"",null,null,null,null,null,"",null,"","","","",null,0,"","","","",{"$f":"IF(K40=\"\",\"\",IF('1-Program Info'!$B$19=\"[Calculated Field]\",0/$AF$2,$AF$6/$AF$2))","v":""},"","","","","","","","","","","","",""]

{"sheet":"8-Process Controls","index":10,"n_rows":334,"n_cols":29,"rows_kept":334,"cut":false,"hidden":false,"merged":[[0,4,0,6],[1,8,1,9],[3,6,4,6],[3,9,4,9],[2,0,2,24],[3,17,4,17],[1,13,1,15],[3,20,4,20],[3,21,4,21],[3,24,4,24],[3,23,4,23],[1,0,1,1],[1,2,1,5],[1,16,1,20],[1,11,1,12],[3,0,4,0],[3,3,4,3],[3,4,4,4],[3,5,4,5],[3,1,4,1],[3,2,4,2],[3,7,4,7],[3,8,4,8],[3,26,3,31],[1,22,1,23],[3,22,4,22],[3,18,4,18],[3,10,4,10],[3,14,4,14],[3,13,4,13],[3,11,3,12],[3,15,4,15],[3,16,4,16],[3,19,4,19]]}
[null,null,null,null,"Click here for an example of the MAPP Process Controls \"8-Process Controls\" completed appropriately",null,null,null,"Manufacturability Assessment and Process Plan - Process Controls"]
["  Part Description:",null,{"$f":"'1-Program Info'!B3","v":"[Enter Part Name Here]"},null,null,null,null,"Part  Number:",{"$f":"'1-Program Info'!B5","v":"[Enter PN Here]"},null,"Drwg Rev:",{"$f":"'1-Program Info'!B7","v":"[Enter Drwg Rev Here]"},null,"Supplier Name:",null,null,{"$f":"'2-Supplier Information'!B3","v":"[Enter Supplier Name Here]"},null,null,null,null,null,"MAPP  Rev Date:                         ",null,"[Enter Revison Date Here]"]
["COMPLETED BY SUPPLIER FOR CL1-CL5 & Vehicle Interface OR EQUIVALENT SAFETY COMPLIANCE FEATURES as stated in the Nexteer Supplier Requirements 8.5.2 and contained in the drop down list under the \"Class\" column "]
["OP #","Process Concept / Process Steps","Road\nMap\nPrint #","Product Characteristic Description","Requirement / Dimension","Class","Vehicle Interface / PTC","Manufacturing Process Feasibility","In-House or\nSub-Supplier Process","Commitment to Meet Required Process Indices","Description of Control or Verification Method\n(e.g. Xbar&R, Variable/Attribute Gage Description)","Detection Activity",null,"Process Control","Defect Handling","Traceability","General Comments and/or Mitigation Plan(s)","Mitigation Plan(s) Owner Name","Included in EPC Plan?\nY/N","SPC control & ongoing capability study in EPC phase\nY/N","Initial Capability for PPAP\nY/N","Status","Control Verification","Required Initial Process Indices","Qualification Plan for PPAP"]
[null,null,null,null,null,null,null,null,null,null,null,"Sample Size & Frequency of Inspection","Detection Control"]
[null,null,null,null,null,null,null,null,null,null,null,null,null,null,null,null,null,null,null,null,null,null,null,{"$f":"IF(AND(F6=\"STD4-8\",G6=\"Yes\"),\"Cpk =/> 1.67    Ppk =/> 1.33\",IF(LEFT(F6,3)=\"STD\",\"Cpk > 1.33    Ppk > 1.33\",(IF(F6=\"CL3\",\"Cpk > 1.33    Ppk > 1.33\",IF(LEFT(F6,2)=\"CL\",\"Cpk > 1.67    Ppk > 1.67\",IF(F6=\"\",\" \",\"Cpk =/> 1.67    Ppk =/> 1.33\"))))))","v":" "},{"$f":"IF(AND(F6=\"STD4-8\",G6=\"Yes\"),\"PPAP Checksheet, 5 pc dimensional layout & capability/gage studies\",IF(LEFT(F6,3)=\"STD\",\"PPAP Checksheet & 5 pc dimensional layout\",IF(F6=\"CL3\",\"PPAP Checksheet, 5pc dimensional layout, gage studies & capability studies, if required\",IF(F6=\"\",\" \",\"PPAP Checksheet, 5 pc dimensional layout & capability/gage studies\"))))","v":" "},null,null,null,{"$f":"IF(ISBLANK(F6),\"\",IF(IFERROR(OR(MATCH(M6,INDIRECT(SUBSTITUTE(F6,\"-\",\"_\")&\"_1\"),0),MATCH(N6,INDIRECT(SUBSTITUTE(F6,\"-\",\"_\")&\"_2\"),0),MATCH(O6,INDIRECT(SUBSTITUTE(F6,\"-\",\"_\")&\"_3\"),0),MATCH(W6,INDIRECT(SUBSTITUTE(F6,\"-\",\"_\")&\"_4\"),0)),\"R\")=\"R\",IF(V6=\"Closed & Approved\",\"G\",IF(V6=\"Mitigation Plan Approved\",\"Y\",\"R\")),IF(OR(ISBLANK(V6),V6=\"Open\"),\"R\",IF(V6=\"Mitigation Plan Approved\",\"Y\",\"G\"))))","v":""}]
[null,null,null,null,null,null,null,null,null,null,null,null,null,null,null,null,null,null,null,null,null,null,null,{"$f":"IF(AND(F7=\"STD4-8\",G7=\"Yes\"),\"Cpk =/> 1.67    Ppk =/> 1.33\",IF(LEFT(F7,3)=\"STD\",\"Cpk > 1.33    Ppk > 1.33\",(IF(F7=\"CL3\",\"Cpk > 1.33    Ppk > 1.33\",IF(LEFT(F7,2)=\"CL\",\"Cpk > 1.67    Ppk > 1.67\",IF(F7=\"\",\" \",\"Cpk =/> 1.67    Ppk =/> 1.33\"))))))","v":" "}," ",null,null,null,{"$f":"IF(ISBLANK(F7),\"\",IF(IFERROR(OR(MATCH(M7,INDIRECT(SUBSTITUTE(F7,\"-\",\"_\")&\"_1\"),0),MATCH(N7,INDIRECT(SUBSTITUTE(F7,\"-\",\"_\")&\"_2\"),0),MATCH(O7,INDIRECT(SUBSTITUTE(F7,\"-\",\"_\")&\"_3\"),0),MATCH(W7,INDIRECT(SUBSTITUTE(F7,\"-\",\"_\")&\"_4\"),0)),\"R\")=\"R\",IF(V7=\"Closed & Approved\",\"G\",IF(V7=\"Mitigation Plan Approved\",\"Y\",\"R\")),\"G\"))","v":""}]
[null,null,null,null,null,null,null,null,null,null,null,null,null,null,null,null,null,null,null,null,null,null,null," "," ",null,null,null,""]
[null,null,null,null,null,null,null,null,null,null,null,null,null,null,null,null,null,null,null,null,null,null,null," "," ",null,null,null,""]
[null,null,null,null,null,null,null,null,null,null,null,null,null,null,null,null,null,null,null,null,null,null,null," "," ",null,null,null,""]
[null,null,null,null,null,null,null,null,null,null,null,null,null,null,null,null,null,null,null,null,null,null,null," "," ",null,null,null,""]
[null,null,null,null,null,null,null,null,null,null,null,null,null,null,null,null,null,null,null,null,null,null,null," "," ",null,null,null,""]
[null,null,null,null,null,null,null,null,null,null,null,null,null,null,null,null,null,null,null,null,null,null,null," "," ",null,null,null,""]
[null,null,null,null,null,null,null,null,null,null,null,null,null,null,null,null,null,null,null,null,null,null,null," "," ",null,null,null,""]
[null,null,null,null,null,null,null,null,null,null,null,null,null,null,null,null,null,null,null,null,null,null,null," "," ",null,null,null,""]
[null,null,null,null,null,null,null,null,null,null,null,null,null,null,null,null,null,null,null,null,null,null,null," "," ",null,null,null,""]
[null,null,null,null,null,null,null,null,null,null,null,null,null,null,null,null,null,null,null,null,null,null,null," "," ",null,null,null,""]
[null,null,null,null,null,null,null,null,null,null,null,null,null,null,null,null,null,null,null,null,null,null,null," "," ",null,null,null,""]
[null,null,null,null,null,null,null,null,null,null,null,null,null,null,null,null,null,null,null,null,null,null,null," "," ",null,null,null,""]
[null,null,null,null,null,null,null,null,null,null,null,null,null,null,null,null,null,null,null,null,null,null,null," "," ",null,null,null,""]
[null,null,null,null,null,null,null,null,null,null,null,null,null,null,null,null,null,null,null,null,null,null,null," "," ",null,null,null,""]
[null,null,null,null,null,null,null,null,null,null,null,null,null,null,null,null,null,null,null,null,null,null,null," "," ",null,null,null,""]
[null,null,null,null,null,null,null,null,null,null,null,null,null,null,null,null,null,null,null,null,null,null,null," "," ",null,null,null,""]
[null,null,null,null,null,null,null,null,null,null,null,null,null,null,null,null,null,null,null,null,null,null,null," "," ",null,null,null,""]
[null,null,null,null,null,null,null,null,null,null,null,null,null,null,null,null,null,null,null,null,null,null,null," "," ",null,null,null,""]
[null,null,null,null,null,null,null,null,null,null,null,null,null,null,null,null,null,null,null,null,null,null,null," "," ",null,null,null,""]
[null,null,null,null,null,null,null,null,null,null,null,null,null,null,null,null,null,null,null,null,null,null,null," "," ",null,null,null,""]
[null,null,null,null,null,null,null,null,null,null,null,null,null,null,null,null,null,null,null,null,null,null,null," "," ",null,null,null,""]
[null,null,null,null,null,null,null,null,null,null,null,null,null,null,null,null,null,null,null,null,null,null,null," "," ",null,null,null,""]
[null,null,null,null,null,null,null,null,null,null,null,null,null,null,null,null,null,null,null,null,null,null,null," "," ",null,null,null,""]
[null,null,null,null,null,null,null,null,null,null,null,null,null,null,null,null,null,null,null,null,null,null,null," "," ",null,null,null,""]
[null,null,null,null,null,null,null,null,null,null,null,null,null,null,null,null,null,null,null,null,null,null,null," "," ",null,null,null,""]
[null,null,null,null,null,null,null,null,null,null,null,null,null,null,null,null,null,null,null,null,null,null,null," "," ",null,null,null,""]
[null,null,null,null,null,null,null,null,null,null,null,null,null,null,null,null,null,null,null,null,null,null,null," "," ",null,null,null,""]
[null,null,null,null,null,null,null,null,null,null,null,null,null,null,null,null,null,null,null,null,null,null,null," "," ",null,null,null,""]
[null,null,null,null,null,null,null,null,null,null,null,null,null,null,null,null,null,null,null,null,null,null,null," "," ",null,null,null,""]
[null,null,null,null,null,null,null,null,null,null,null,null,null,null,null,null,null,null,null,null,null,null,null," "," ",null,null,null,""]
[null,null,null,null,null,null,null,null,null,null,null,null,null,null,null,null,null,null,null,null,null,null,null," "," ",null,null,null,""]
[null,null,null,null,null,null,null,null,null,null,null,null,null,null,null,null,null,null,null,null,null,null,null," "," ",null,null,null,""]
[null,null,null,null,null,null,null,null,null,null,null,null,null,null,null,null,null,null,null,null,null,null,null," "," ",null,null,null,""]
[null,null,null,null,null,null,null,null,null,null,null,null,null,null,null,null,null,null,null,null,null,null,null," "," ",null,null,null,""]
[null,null,null,null,null,null,null,null,null,null,null,null,null,null,null,null,null,null,null,null,null,null,null," "," ",null,null,null,""]
[null,null,null,null,null,null,null,null,null,null,null,null,null,null,null,null,null,null,null,null,null,null,null," "," ",null,null,null,""]
[null,null,null,null,null,null,null,null,null,null,null,null,null,null,null,null,null,null,null,null,null,null,null," "," ",null,null,null,""]
[null,null,null,null,null,null,null,null,null,null,null,null,null,null,null,null,null,null,null,null,null,null,null," "," ",null,null,null,""]
[null,null,null,null,null,null,null,null,null,null,null,null,null,null,null,null,null,null,null,null,null,null,null," "," ",null,null,null,""]
[null,null,null,null,null,null,null,null,null,null,null,null,null,null,null,null,null,null,null,null,null,null,null," "," ",null,null,null,""]
[null,null,null,null,null,null,null,null,null,null,null,null,null,null,null,null,null,null,null,null,null,null,null," "," ",null,null,null,""]
[null,null,null,null,null,null,null,null,null,null,null,null,null,null,null,null,null,null,null,null,null,null,null," "," ",null,null,null,""]
[null,null,null,null,null,null,null,null,null,null,null,null,null,null,null,null,null,null,null,null,null,null,null," "," ",null,null,null,""]
[null,null,null,null,null,null,null,null,null,null,null,null,null,null,null,null,null,null,null,null,null,null,null," "," ",null,null,null,""]
[null,null,null,null,null,null,null,null,null,null,null,null,null,null,null,null,null,null,null,null,null,null,null," "," ",null,null,null,""]
[null,null,null,null,null,null,null,null,null,null,null,null,null,null,null,null,null,null,null,null,null,null,null," "," ",null,null,null,""]
[null,null,null,null,null,null,null,null,null,null,null,null,null,null,null,null,null,null,null,null,null,null,null," "," ",null,null,null,""]
[null,null,null,null,null,null,null,null,null,null,null,null,null,null,null,null,null,null,null,null,null,null,null," "," ",null,null,null,""]
[null,null,null,null,null,null,null,null,null,null,null,null,null,null,null,null,null,null,null,null,null,null,null," "," ",null,null,null,""]
[null,null,null,null,null,null,null,null,null,null,null,null,null,null,null,null,null,null,null,null,null,null,null," "," ",null,null,null,""]
[null,null,null,null,null,null,null,null,null,null,null,null,null,null,null,null,null,null,null,null,null,null,null," "," ",null,null,null,""]
[null,null,null,null,null,null,null,null,null,null,null,null,null,null,null,null,null,null,null,null,null,null,null," "," ",null,null,null,""]
[null,null,null,null,null,null,null,null,null,null,null,null,null,null,null,null,null,null,null,null,null,null,null," "," ",null,null,null,""]
[null,null,null,null,null,null,null,null,null,null,null,null,null,null,null,null,null,null,null,null,null,null,null," "," ",null,null,null,""]
[null,null,null,null,null,null,null,null,null,null,null,null,null,null,null,null,null,null,null,null,null,null,null," "," ",null,null,null,""]
[null,null,null,null,null,null,null,null,null,null,null,null,null,null,null,null,null,null,null,null,null,null,null," "," ",null,null,null,""]
[null,null,null,null,null,null,null,null,null,null,null,null,null,null,null,null,null,null,null,null,null,null,null," "," ",null,null,null,""]
[null,null,null,null,null,null,null,null,null,null,null,null,null,null,null,null,null,null,null,null,null,null,null," "," ",null,null,null,""]
[null,null,null,null,null,null,null,null,null,null,null,null,null,null,null,null,null,null,null,null,null,null,null," "," ",null,null,null,""]
[null,null,null,null,null,null,null,null,null,null,null,null,null,null,null,null,null,null,null,null,null,null,null," "," ",null,null,null,""]
[null,null,null,null,null,null,null,null,null,null,null,null,null,null,null,null,null,null,null,null,null,null,null," "," ",null,null,null,""]
[null,null,null,null,null,null,null,null,null,null,null,null,null,null,null,null,null,null,null,null,null,null,null," "," ",null,null,null,""]
[null,null,null,null,null,null,null,null,null,null,null,null,null,null,null,null,null,null,null,null,null,null,null," ",{"$f":"IF(AND(F70=\"STD4-8\",G70=\"Yes\"),\"PPAP Checksheet, 5 pc dimensional layout & capability/gage studies\",IF(LEFT(F70,3)=\"STD\",\"PPAP Checksheet & 5 pc dimensional layout\",IF(F70=\"CL3\",\"PPAP Checksheet, 5pc dimensional layout, gage studies & capability studies, if required\",IF(F70=\"\",\" \",\"PPAP Checksheet, 5 pc dimensional layout & capability/gage studies\"))))","v":" "},null,null,null,""]
[null,null,null,null,null,null,null,null,null,null,null,null,null,null,null,null,null,null,null,null,null,null,null,{"$f":"IF(AND(F71=\"STD4-8\",G71=\"Yes\"),\"Cpk =/> 1.67    Ppk =/> 1.33\",IF(LEFT(F71,3)=\"STD\",\"Cpk > 1.33    Ppk > 1.33\",(IF(F71=\"CL3\",\"Cpk > 1.33    Ppk > 1.33\",IF(LEFT(F71,2)=\"CL\",\"Cpk > 1.67    Ppk > 1.67\",IF(F71=\"\",\" \",\"Cpk =/> 1.67    Ppk =/> 1.33\"))))))","v":" "}," ",null,null,null,{"$f":"IF(ISBLANK(F71),\"\",IF(IFERROR(OR(MATCH(M71,INDIRECT(SUBSTITUTE(F71,\"-\",\"_\")&\"_1\"),0),MATCH(N71,INDIRECT(SUBSTITUTE(F71,\"-\",\"_\")&\"_2\"),0),MATCH(O71,INDIRECT(SUBSTITUTE(F71,\"-\",\"_\")&\"_3\"),0),MATCH(W71,INDIRECT(SUBSTITUTE(F71,\"-\",\"_\")&\"_4\"),0)),\"R\")=\"R\",IF(V71=\"Closed & Approved\",\"G\",IF(V71=\"Mitigation Plan Approved\",\"Y\",\"R\")),\"G\"))","v":""}]
[null,null,null,null,null,null,null,null,null,null,null,null,null,null,null,null,null,null,null,null,null,null,null," "," ",null,null,null,""]
[null,null,null,null,null,null,null,null,null,null,null,null,null,null,null,null,null,null,null,null,null,null,null," "," ",null,null,null,""]
[null,null,null,null,null,null,null,null,null,null,null,null,null,null,null,null,null,null,null,null,null,null,null," "," ",null,null,null,""]
[null,null,null,null,null,null,null,null,null,null,null,null,null,null,null,null,null,null,null,null,null,null,null," "," ",null,null,null,""]
[null,null,null,null,null,null,null,null,null,null,null,null,null,null,null,null,null,null,null,null,null,null,null," "," ",null,null,null,""]
[null,null,null,null,null,null,null,null,null,null,null,null,null,null,null,null,null,null,null,null,null,null,null," "," ",null,null,null,""]
[null,null,null,null,null,null,null,null,null,null,null,null,null,null,null,null,null,null,null,null,null,null,null," "," ",null,null,null,""]
[null,null,null,null,null,null,null,null,null,null,null,null,null,null,null,null,null,null,null,null,null,null,null," "," ",null,null,null,""]
[null,null,null,null,null,null,null,null,null,null,null,null,null,null,null,null,null,null,null,null,null,null,null," "," ",null,null,null,""]
[null,null,null,null,null,null,null,null,null,null,null,null,null,null,null,null,null,null,null,null,null,null,null," "," ",null,null,null,""]
[null,null,null,null,null,null,null,null,null,null,null,null,null,null,null,null,null,null,null,null,null,null,null," "," ",null,null,null,""]
[null,null,null,null,null,null,null,null,null,null,null,null,null,null,null,null,null,null,null,null,null,null,null," "," ",null,null,null,""]
[null,null,null,null,null,null,null,null,null,null,null,null,null,null,null,null,null,null,null,null,null,null,null," "," ",null,null,null,""]
[null,null,null,null,null,null,null,null,null,null,null,null,null,null,null,null,null,null,null,null,null,null,null," "," ",null,null,null,""]
[null,null,null,null,null,null,null,null,null,null,null,null,null,null,null,null,null,null,null,null,null,null,null," "," ",null,null,null,""]
[null,null,null,null,null,null,null,null,null,null,null,null,null,null,null,null,null,null,null,null,null,null,null," "," ",null,null,null,""]
[null,null,null,null,null,null,null,null,null,null,null,null,null,null,null,null,null,null,null,null,null,null,null," "," ",null,null,null,""]
[null,null,null,null,null,null,null,null,null,null,null,null,null,null,null,null,null,null,null,null,null,null,null," "," ",null,null,null,""]
[null,null,null,null,null,null,null,null,null,null,null,null,null,null,null,null,null,null,null,null,null,null,null," "," ",null,null,null,""]
[null,null,null,null,null,null,null,null,null,null,null,null,null,null,null,null,null,null,null,null,null,null,null," "," ",null,null,null,""]
[null,null,null,null,null,null,null,null,null,null,null,null,null,null,null,null,null,null,null,null,null,null,null," "," ",null,null,null,""]
[null,null,null,null,null,null,null,null,null,null,null,null,null,null,null,null,null,null,null,null,null,null,null," "," ",null,null,null,""]
[null,null,null,null,null,null,null,null,null,null,null,null,null,null,null,null,null,null,null,null,null,null,null," "," ",null,null,null,""]
[null,null,null,null,null,null,null,null,null,null,null,null,null,null,null,null,null,null,null,null,null,null,null," "," ",null,null,null,""]
[null,null,null,null,null,null,null,null,null,null,null,null,null,null,null,null,null,null,null,null,null,null,null," "," ",null,null,null,""]
[null,null,null,null,null,null,null,null,null,null,null,null,null,null,null,null,null,null,null,null,null,null,null," "," ",null,null,null,""]
[null,null,null,null,null,null,null,null,null,null,null,null,null,null,null,null,null,null,null,null,null,null,null," "," ",null,null,null,""]
[null,null,null,null,null,null,null,null,null,null,null,null,null,null,null,null,null,null,null,null,null,null,null," "," ",null,null,null,""]
[null,null,null,null,null,null,null,null,null,null,null,null,null,null,null,null,null,null,null,null,null,null,null," "," ",null,null,null,""]
[null,null,null,null,null,null,null,null,null,null,null,null,null,null,null,null,null,null,null,null,null,null,null," "," ",null,null,null,""]
[null,null,null,null,null,null,null,null,null,null,null,null,null,null,null,null,null,null,null,null,null,null,null," "," ",null,null,null,""]
[null,null,null,null,null,null,null,null,null,null,null,null,null,null,null,null,null,null,null,null,null,null,null," "," ",null,null,null,""]
[null,null,null,null,null,null,null,null,null,null,null,null,null,null,null,null,null,null,null,null,null,null,null," "," ",null,null,null,""]
[null,null,null,null,null,null,null,null,null,null,null,null,null,null,null,null,null,null,null,null,null,null,null," "," ",null,null,null,""]
[null,null,null,null,null,null,null,null,null,null,null,null,null,null,null,null,null,null,null,null,null,null,null," "," ",null,null,null,""]
[null,null,null,null,null,null,null,null,null,null,null,null,null,null,null,null,null,null,null,null,null,null,null," "," ",null,null,null,""]
[null,null,null,null,null,null,null,null,null,null,null,null,null,null,null,null,null,null,null,null,null,null,null," "," ",null,null,null,""]
[null,null,null,null,null,null,null,null,null,null,null,null,null,null,null,null,null,null,null,null,null,null,null," "," ",null,null,null,""]
[null,null,null,null,null,null,null,null,null,null,null,null,null,null,null,null,null,null,null,null,null,null,null," "," ",null,null,null,""]
[null,null,null,null,null,null,null,null,null,null,null,null,null,null,null,null,null,null,null,null,null,null,null," "," ",null,null,null,""]
[null,null,null,null,null,null,null,null,null,null,null,null,null,null,null,null,null,null,null,null,null,null,null," "," ",null,null,null,""]
[null,null,null,null,null,null,null,null,null,null,null,null,null,null,null,null,null,null,null,null,null,null,null," "," ",null,null,null,""]
[null,null,null,null,null,null,null,null,null,null,null,null,null,null,null,null,null,null,null,null,null,null,null," "," ",null,null,null,""]
[null,null,null,null,null,null,null,null,null,null,null,null,null,null,null,null,null,null,null,null,null,null,null," "," ",null,null,null,""]
[null,null,null,null,null,null,null,null,null,null,null,null,null,null,null,null,null,null,null,null,null,null,null," "," ",null,null,null,""]
[null,null,null,null,null,null,null,null,null,null,null,null,null,null,null,null,null,null,null,null,null,null,null," "," ",null,null,null,""]
[null,null,null,null,null,null,null,null,null,null,null,null,null,null,null,null,null,null,null,null,null,null,null," "," ",null,null,null,""]
[null,null,null,null,null,null,null,null,null,null,null,null,null,null,null,null,null,null,null,null,null,null,null," "," ",null,null,null,""]
[null,null,null,null,null,null,null,null,null,null,null,null,null,null,null,null,null,null,null,null,null,null,null," "," ",null,null,null,""]
[null,null,null,null,null,null,null,null,null,null,null,null,null,null,null,null,null,null,null,null,null,null,null," "," ",null,null,null,""]
[null,null,null,null,null,null,null,null,null,null,null,null,null,null,null,null,null,null,null,null,null,null,null," "," ",null,null,null,""]
[null,null,null,null,null,null,null,null,null,null,null,null,null,null,null,null,null,null,null,null,null,null,null," "," ",null,null,null,""]
[null,null,null,null,null,null,null,null,null,null,null,null,null,null,null,null,null,null,null,null,null,null,null," "," ",null,null,null,""]
[null,null,null,null,null,null,null,null,null,null,null,null,null,null,null,null,null,null,null,null,null,null,null," "," ",null,null,null,""]
[null,null,null,null,null,null,null,null,null,null,null,null,null,null,null,null,null,null,null,null,null,null,null," "," ",null,null,null,""]
[null,null,null,null,null,null,null,null,null,null,null,null,null,null,null,null,null,null,null,null,null,null,null," "," ",null,null,null,""]
[null,null,null,null,null,null,null,null,null,null,null,null,null,null,null,null,null,null,null,null,null,null,null," "," ",null,null,null,""]
[null,null,null,null,null,null,null,null,null,null,null,null,null,null,null,null,null,null,null,null,null,null,null," "," ",null,null,null,""]
[null,null,null,null,null,null,null,null,null,null,null,null,null,null,null,null,null,null,null,null,null,null,null," "," ",null,null,null,""]
[null,null,null,null,null,null,null,null,null,null,null,null,null,null,null,null,null,null,null,null,null,null,null," "," ",null,null,null,""]
[null,null,null,null,null,null,null,null,null,null,null,null,null,null,null,null,null,null,null,null,null,null,null," "," ",null,null,null,""]
[null,null,null,null,null,null,null,null,null,null,null,null,null,null,null,null,null,null,null,null,null,null,null," "," ",null,null,null,""]
[null,null,null,null,null,null,null,null,null,null,null,null,null,null,null,null,null,null,null,null,null,null,null," ",{"$f":"IF(AND(F134=\"STD4-8\",G134=\"Yes\"),\"PPAP Checksheet, 5 pc dimensional layout & capability/gage studies\",IF(LEFT(F134,3)=\"STD\",\"PPAP Checksheet & 5 pc dimensional layout\",IF(F134=\"CL3\",\"PPAP Checksheet, 5pc dimensional layout, gage studies & capability studies, if required\",IF(F134=\"\",\" \",\"PPAP Checksheet, 5 pc dimensional layout & capability/gage studies\"))))","v":" "},null,null,null,""]
[null,null,null,null,null,null,null,null,null,null,null,null,null,null,null,null,null,null,null,null,null,null,null,{"$f":"IF(AND(F135=\"STD4-8\",G135=\"Yes\"),\"Cpk =/> 1.67    Ppk =/> 1.33\",IF(LEFT(F135,3)=\"STD\",\"Cpk > 1.33    Ppk > 1.33\",(IF(F135=\"CL3\",\"Cpk > 1.33    Ppk > 1.33\",IF(LEFT(F135,2)=\"CL\",\"Cpk > 1.67    Ppk > 1.67\",IF(F135=\"\",\" \",\"Cpk =/> 1.67    Ppk =/> 1.33\"))))))","v":" "}," ",null,null,null,{"$f":"IF(ISBLANK(F135),\"\",IF(IFERROR(OR(MATCH(M135,INDIRECT(SUBSTITUTE(F135,\"-\",\"_\")&\"_1\"),0),MATCH(N135,INDIRECT(SUBSTITUTE(F135,\"-\",\"_\")&\"_2\"),0),MATCH(O135,INDIRECT(SUBSTITUTE(F135,\"-\",\"_\")&\"_3\"),0),MATCH(W135,INDIRECT(SUBSTITUTE(F135,\"-\",\"_\")&\"_4\"),0)),\"R\")=\"R\",IF(V135=\"Closed & Approved\",\"G\",IF(V135=\"Mitigation Plan Approved\",\"Y\",\"R\")),\"G\"))","v":""}]
[null,null,null,null,null,null,null,null,null,null,null,null,null,null,null,null,null,null,null,null,null,null,null," "," ",null,null,null,""]
[null,null,null,null,null,null,null,null,null,null,null,null,null,null,null,null,null,null,null,null,null,null,null," "," ",null,null,null,""]
[null,null,null,null,null,null,null,null,null,null,null,null,null,null,null,null,null,null,null,null,null,null,null," "," ",null,null,null,""]
[null,null,null,null,null,null,null,null,null,null,null,null,null,null,null,null,null,null,null,null,null,null,null," "," ",null,null,null,""]
[null,null,null,null,null,null,null,null,null,null,null,null,null,null,null,null,null,null,null,null,null,null,null," "," ",null,null,null,""]
[null,null,null,null,null,null,null,null,null,null,null,null,null,null,null,null,null,null,null,null,null,null,null," "," ",null,null,null,""]
[null,null,null,null,null,null,null,null,null,null,null,null,null,null,null,null,null,null,null,null,null,null,null," "," ",null,null,null,""]
[null,null,null,null,null,null,null,null,null,null,null,null,null,null,null,null,null,null,null,null,null,null,null," "," ",null,null,null,""]
[null,null,null,null,null,null,null,null,null,null,null,null,null,null,null,null,null,null,null,null,null,null,null," "," ",null,null,null,""]
[null,null,null,null,null,null,null,null,null,null,null,null,null,null,null,null,null,null,null,null,null,null,null," "," ",null,null,null,""]
[null,null,null,null,null,null,null,null,null,null,null,null,null,null,null,null,null,null,null,null,null,null,null," "," ",null,null,null,""]
[null,null,null,null,null,null,null,null,null,null,null,null,null,null,null,null,null,null,null,null,null,null,null," "," ",null,null,null,""]
[null,null,null,null,null,null,null,null,null,null,null,null,null,null,null,null,null,null,null,null,null,null,null," "," ",null,null,null,""]
[null,null,null,null,null,null,null,null,null,null,null,null,null,null,null,null,null,null,null,null,null,null,null," "," ",null,null,null,""]
[null,null,null,null,null,null,null,null,null,null,null,null,null,null,null,null,null,null,null,null,null,null,null," "," ",null,null,null,""]
[null,null,null,null,null,null,null,null,null,null,null,null,null,null,null,null,null,null,null,null,null,null,null," "," ",null,null,null,""]
[null,null,null,null,null,null,null,null,null,null,null,null,null,null,null,null,null,null,null,null,null,null,null," "," ",null,null,null,""]
[null,null,null,null,null,null,null,null,null,null,null,null,null,null,null,null,null,null,null,null,null,null,null," "," ",null,null,null,""]
[null,null,null,null,null,null,null,null,null,null,null,null,null,null,null,null,null,null,null,null,null,null,null," "," ",null,null,null,""]
[null,null,null,null,null,null,null,null,null,null,null,null,null,null,null,null,null,null,null,null,null,null,null," "," ",null,null,null,""]
[null,null,null,null,null,null,null,null,null,null,null,null,null,null,null,null,null,null,null,null,null,null,null," "," ",null,null,null,""]
[null,null,null,null,null,null,null,null,null,null,null,null,null,null,null,null,null,null,null,null,null,null,null," "," ",null,null,null,""]
[null,null,null,null,null,null,null,null,null,null,null,null,null,null,null,null,null,null,null,null,null,null,null," "," ",null,null,null,""]
[null,null,null,null,null,null,null,null,null,null,null,null,null,null,null,null,null,null,null,null,null,null,null," "," ",null,null,null,""]
[null,null,null,null,null,null,null,null,null,null,null,null,null,null,null,null,null,null,null,null,null,null,null," "," ",null,null,null,""]
[null,null,null,null,null,null,null,null,null,null,null,null,null,null,null,null,null,null,null,null,null,null,null," "," ",null,null,null,""]
[null,null,null,null,null,null,null,null,null,null,null,null,null,null,null,null,null,null,null,null,null,null,null," "," ",null,null,null,""]
[null,null,null,null,null,null,null,null,null,null,null,null,null,null,null,null,null,null,null,null,null,null,null," "," ",null,null,null,""]
[null,null,null,null,null,null,null,null,null,null,null,null,null,null,null,null,null,null,null,null,null,null,null," "," ",null,null,null,""]
[null,null,null,null,null,null,null,null,null,null,null,null,null,null,null,null,null,null,null,null,null,null,null," "," ",null,null,null,""]
[null,null,null,null,null,null,null,null,null,null,null,null,null,null,null,null,null,null,null,null,null,null,null," "," ",null,null,null,""]
[null,null,null,null,null,null,null,null,null,null,null,null,null,null,null,null,null,null,null,null,null,null,null," "," ",null,null,null,""]
[null,null,null,null,null,null,null,null,null,null,null,null,null,null,null,null,null,null,null,null,null,null,null," "," ",null,null,null,""]
[null,null,null,null,null,null,null,null,null,null,null,null,null,null,null,null,null,null,null,null,null,null,null," "," ",null,null,null,""]
[null,null,null,null,null,null,null,null,null,null,null,null,null,null,null,null,null,null,null,null,null,null,null," "," ",null,null,null,""]
[null,null,null,null,null,null,null,null,null,null,null,null,null,null,null,null,null,null,null,null,null,null,null," "," ",null,null,null,""]
[null,null,null,null,null,null,null,null,null,null,null,null,null,null,null,null,null,null,null,null,null,null,null," "," ",null,null,null,""]
[null,null,null,null,null,null,null,null,null,null,null,null,null,null,null,null,null,null,null,null,null,null,null," "," ",null,null,null,""]
[null,null,null,null,null,null,null,null,null,null,null,null,null,null,null,null,null,null,null,null,null,null,null," "," ",null,null,null,""]
[null,null,null,null,null,null,null,null,null,null,null,null,null,null,null,null,null,null,null,null,null,null,null," "," ",null,null,null,""]
[null,null,null,null,null,null,null,null,null,null,null,null,null,null,null,null,null,null,null,null,null,null,null," "," ",null,null,null,""]
[null,null,null,null,null,null,null,null,null,null,null,null,null,null,null,null,null,null,null,null,null,null,null," "," ",null,null,null,""]
[null,null,null,null,null,null,null,null,null,null,null,null,null,null,null,null,null,null,null,null,null,null,null," "," ",null,null,null,""]
[null,null,null,null,null,null,null,null,null,null,null,null,null,null,null,null,null,null,null,null,null,null,null," "," ",null,null,null,""]
[null,null,null,null,null,null,null,null,null,null,null,null,null,null,null,null,null,null,null,null,null,null,null," "," ",null,null,null,""]
[null,null,null,null,null,null,null,null,null,null,null,null,null,null,null,null,null,null,null,null,null,null,null," "," ",null,null,null,""]
[null,null,null,null,null,null,null,null,null,null,null,null,null,null,null,null,null,null,null,null,null,null,null," "," ",null,null,null,""]
[null,null,null,null,null,null,null,null,null,null,null,null,null,null,null,null,null,null,null,null,null,null,null," "," ",null,null,null,""]
[null,null,null,null,null,null,null,null,null,null,null,null,null,null,null,null,null,null,null,null,null,null,null," "," ",null,null,null,""]
[null,null,null,null,null,null,null,null,null,null,null,null,null,null,null,null,null,null,null,null,null,null,null," "," ",null,null,null,""]
[null,null,null,null,null,null,null,null,null,null,null,null,null,null,null,null,null,null,null,null,null,null,null," "," ",null,null,null,""]
[null,null,null,null,null,null,null,null,null,null,null,null,null,null,null,null,null,null,null,null,null,null,null," "," ",null,null,null,""]
[null,null,null,null,null,null,null,null,null,null,null,null,null,null,null,null,null,null,null,null,null,null,null," "," ",null,null,null,""]
[null,null,null,null,null,null,null,null,null,null,null,null,null,null,null,null,null,null,null,null,null,null,null," "," ",null,null,null,""]
[null,null,null,null,null,null,null,null,null,null,null,null,null,null,null,null,null,null,null,null,null,null,null," "," ",null,null,null,""]
[null,null,null,null,null,null,null,null,null,null,null,null,null,null,null,null,null,null,null,null,null,null,null," "," ",null,null,null,""]
[null,null,null,null,null,null,null,null,null,null,null,null,null,null,null,null,null,null,null,null,null,null,null," "," ",null,null,null,""]
[null,null,null,null,null,null,null,null,null,null,null,null,null,null,null,null,null,null,null,null,null,null,null," "," ",null,null,null,""]
[null,null,null,null,null,null,null,null,null,null,null,null,null,null,null,null,null,null,null,null,null,null,null," "," ",null,null,null,""]
[null,null,null,null,null,null,null,null,null,null,null,null,null,null,null,null,null,null,null,null,null,null,null," "," ",null,null,null,""]
[null,null,null,null,null,null,null,null,null,null,null,null,null,null,null,null,null,null,null,null,null,null,null," "," ",null,null,null,""]
[null,null,null,null,null,null,null,null,null,null,null,null,null,null,null,null,null,null,null,null,null,null,null," "," ",null,null,null,""]
[null,null,null,null,null,null,null,null,null,null,null,null,null,null,null,null,null,null,null,null,null,null,null," ",{"$f":"IF(AND(F198=\"STD4-8\",G198=\"Yes\"),\"PPAP Checksheet, 5 pc dimensional layout & capability/gage studies\",IF(LEFT(F198,3)=\"STD\",\"PPAP Checksheet & 5 pc dimensional layout\",IF(F198=\"CL3\",\"PPAP Checksheet, 5pc dimensional layout, gage studies & capability studies, if required\",IF(F198=\"\",\" \",\"PPAP Checksheet, 5 pc dimensional layout & capability/gage studies\"))))","v":" "},null,null,null,""]
[null,null,null,null,null,null,null,null,null,null,null,null,null,null,null,null,null,null,null,null,null,null,null,{"$f":"IF(AND(F199=\"STD4-8\",G199=\"Yes\"),\"Cpk =/> 1.67    Ppk =/> 1.33\",IF(LEFT(F199,3)=\"STD\",\"Cpk > 1.33    Ppk > 1.33\",(IF(F199=\"CL3\",\"Cpk > 1.33    Ppk > 1.33\",IF(LEFT(F199,2)=\"CL\",\"Cpk > 1.67    Ppk > 1.67\",IF(F199=\"\",\" \",\"Cpk =/> 1.67    Ppk =/> 1.33\"))))))","v":" "}," ",null,null,null,{"$f":"IF(ISBLANK(F199),\"\",IF(IFERROR(OR(MATCH(M199,INDIRECT(SUBSTITUTE(F199,\"-\",\"_\")&\"_1\"),0),MATCH(N199,INDIRECT(SUBSTITUTE(F199,\"-\",\"_\")&\"_2\"),0),MATCH(O199,INDIRECT(SUBSTITUTE(F199,\"-\",\"_\")&\"_3\"),0),MATCH(W199,INDIRECT(SUBSTITUTE(F199,\"-\",\"_\")&\"_4\"),0)),\"R\")=\"R\",IF(V199=\"Closed & Approved\",\"G\",IF(V199=\"Mitigation Plan Approved\",\"Y\",\"R\")),\"G\"))","v":""}]
[null,null,null,null,null,null,null,null,null,null,null,null,null,null,null,null,null,null,null,null,null,null,null," "," ",null,null,null,""]
[null,null,null,null,null,null,null,null,null,null,null,null,null,null,null,null,null,null,null,null,null,null,null," "," ",null,null,null,""]
[null,null,null,null,null,null,null,null,null,null,null,null,null,null,null,null,null,null,null,null,null,null,null," "," ",null,null,null,""]
[null,null,null,null,null,null,null,null,null,null,null,null,null,null,null,null,null,null,null,null,null,null,null," "," ",null,null,null,""]
[null,null,null,null,null,null,null,null,null,null,null,null,null,null,null,null,null,null,null,null,null,null,null," "," ",null,null,null,""]
[null,null,null,null,null,null,null,null,null,null,null,null,null,null,null,null,null,null,null,null,null,null,null," "," ",null,null,null,""]
[null,null,null,null,null,null,null,null,null,null,null,null,null,null,null,null,null,null,null,null,null,null,null," "," ",null,null,null,""]
[null,null,null,null,null,null,null,null,null,null,null,null,null,null,null,null,null,null,null,null,null,null,null," "," ",null,null,null,""]
[null,null,null,null,null,null,null,null,null,null,null,null,null,null,null,null,null,null,null,null,null,null,null," "," ",null,null,null,""]
[null,null,null,null,null,null,null,null,null,null,null,null,null,null,null,null,null,null,null,null,null,null,null," "," ",null,null,null,""]
[null,null,null,null,null,null,null,null,null,null,null,null,null,null,null,null,null,null,null,null,null,null,null," "," ",null,null,null,""]
[null,null,null,null,null,null,null,null,null,null,null,null,null,null,null,null,null,null,null,null,null,null,null," "," ",null,null,null,""]
[null,null,null,null,null,null,null,null,null,null,null,null,null,null,null,null,null,null,null,null,null,null,null," "," ",null,null,null,""]
[null,null,null,null,null,null,null,null,null,null,null,null,null,null,null,null,null,null,null,null,null,null,null," "," ",null,null,null,""]
[null,null,null,null,null,null,null,null,null,null,null,null,null,null,null,null,null,null,null,null,null,null,null," "," ",null,null,null,""]
[null,null,null,null,null,null,null,null,null,null,null,null,null,null,null,null,null,null,null,null,null,null,null," "," ",null,null,null,""]
[null,null,null,null,null,null,null,null,null,null,null,null,null,null,null,null,null,null,null,null,null,null,null," "," ",null,null,null,""]
[null,null,null,null,null,null,null,null,null,null,null,null,null,null,null,null,null,null,null,null,null,null,null," "," ",null,null,null,""]
[null,null,null,null,null,null,null,null,null,null,null,null,null,null,null,null,null,null,null,null,null,null,null," "," ",null,null,null,""]
[null,null,null,null,null,null,null,null,null,null,null,null,null,null,null,null,null,null,null,null,null,null,null," "," ",null,null,null,""]
[null,null,null,null,null,null,null,null,null,null,null,null,null,null,null,null,null,null,null,null,null,null,null," "," ",null,null,null,""]
[null,null,null,null,null,null,null,null,null,null,null,null,null,null,null,null,null,null,null,null,null,null,null," "," ",null,null,null,""]
[null,null,null,null,null,null,null,null,null,null,null,null,null,null,null,null,null,null,null,null,null,null,null," "," ",null,null,null,""]
[null,null,null,null,null,null,null,null,null,null,null,null,null,null,null,null,null,null,null,null,null,null,null," "," ",null,null,null,""]
[null,null,null,null,null,null,null,null,null,null,null,null,null,null,null,null,null,null,null,null,null,null,null," "," ",null,null,null,""]
[null,null,null,null,null,null,null,null,null,null,null,null,null,null,null,null,null,null,null,null,null,null,null," "," ",null,null,null,""]
[null,null,null,null,null,null,null,null,null,null,null,null,null,null,null,null,null,null,null,null,null,null,null," "," ",null,null,null,""]
[null,null,null,null,null,null,null,null,null,null,null,null,null,null,null,null,null,null,null,null,null,null,null," "," ",null,null,null,""]
[null,null,null,null,null,null,null,null,null,null,null,null,null,null,null,null,null,null,null,null,null,null,null," "," ",null,null,null,""]
[null,null,null,null,null,null,null,null,null,null,null,null,null,null,null,null,null,null,null,null,null,null,null," "," ",null,null,null,""]
[null,null,null,null,null,null,null,null,null,null,null,null,null,null,null,null,null,null,null,null,null,null,null," "," ",null,null,null,""]
[null,null,null,null,null,null,null,null,null,null,null,null,null,null,null,null,null,null,null,null,null,null,null," "," ",null,null,null,""]
[null,null,null,null,null,null,null,null,null,null,null,null,null,null,null,null,null,null,null,null,null,null,null," "," ",null,null,null,""]
[null,null,null,null,null,null,null,null,null,null,null,null,null,null,null,null,null,null,null,null,null,null,null," "," ",null,null,null,""]
[null,null,null,null,null,null,null,null,null,null,null,null,null,null,null,null,null,null,null,null,null,null,null," "," ",null,null,null,""]
[null,null,null,null,null,null,null,null,null,null,null,null,null,null,null,null,null,null,null,null,null,null,null," "," ",null,null,null,""]
[null,null,null,null,null,null,null,null,null,null,null,null,null,null,null,null,null,null,null,null,null,null,null," "," ",null,null,null,""]
[null,null,null,null,null,null,null,null,null,null,null,null,null,null,null,null,null,null,null,null,null,null,null," "," ",null,null,null,""]
[null,null,null,null,null,null,null,null,null,null,null,null,null,null,null,null,null,null,null,null,null,null,null," "," ",null,null,null,""]
[null,null,null,null,null,null,null,null,null,null,null,null,null,null,null,null,null,null,null,null,null,null,null," "," ",null,null,null,""]
[null,null,null,null,null,null,null,null,null,null,null,null,null,null,null,null,null,null,null,null,null,null,null," "," ",null,null,null,""]
[null,null,null,null,null,null,null,null,null,null,null,null,null,null,null,null,null,null,null,null,null,null,null," "," ",null,null,null,""]
[null,null,null,null,null,null,null,null,null,null,null,null,null,null,null,null,null,null,null,null,null,null,null," "," ",null,null,null,""]
[null,null,null,null,null,null,null,null,null,null,null,null,null,null,null,null,null,null,null,null,null,null,null," "," ",null,null,null,""]
[null,null,null,null,null,null,null,null,null,null,null,null,null,null,null,null,null,null,null,null,null,null,null," "," ",null,null,null,""]
[null,null,null,null,null,null,null,null,null,null,null,null,null,null,null,null,null,null,null,null,null,null,null," "," ",null,null,null,""]
[null,null,null,null,null,null,null,null,null,null,null,null,null,null,null,null,null,null,null,null,null,null,null," "," ",null,null,null,""]
[null,null,null,null,null,null,null,null,null,null,null,null,null,null,null,null,null,null,null,null,null,null,null," "," ",null,null,null,""]
[null,null,null,null,null,null,null,null,null,null,null,null,null,null,null,null,null,null,null,null,null,null,null," "," ",null,null,null,""]
[null,null,null,null,null,null,null,null,null,null,null,null,null,null,null,null,null,null,null,null,null,null,null," "," ",null,null,null,""]
[null,null,null,null,null,null,null,null,null,null,null,null,null,null,null,null,null,null,null,null,null,null,null," "," ",null,null,null,""]
[null,null,null,null,null,null,null,null,null,null,null,null,null,null,null,null,null,null,null,null,null,null,null," "," ",null,null,null,""]
[null,null,null,null,null,null,null,null,null,null,null,null,null,null,null,null,null,null,null,null,null,null,null," "," ",null,null,null,""]
[null,null,null,null,null,null,null,null,null,null,null,null,null,null,null,null,null,null,null,null,null,null,null," "," ",null,null,null,""]
[null,null,null,null,null,null,null,null,null,null,null,null,null,null,null,null,null,null,null,null,null,null,null," "," ",null,null,null,""]
[null,null,null,null,null,null,null,null,null,null,null,null,null,null,null,null,null,null,null,null,null,null,null," "," ",null,null,null,""]
[null,null,null,null,null,null,null,null,null,null,null,null,null,null,null,null,null,null,null,null,null,null,null," "," ",null,null,null,""]
[null,null,null,null,null,null,null,null,null,null,null,null,null,null,null,null,null,null,null,null,null,null,null," "," ",null,null,null,""]
[null,null,null,null,null,null,null,null,null,null,null,null,null,null,null,null,null,null,null,null,null,null,null," "," ",null,null,null,""]
[null,null,null,null,null,null,null,null,null,null,null,null,null,null,null,null,null,null,null,null,null,null,null," "," ",null,null,null,""]
[null,null,null,null,null,null,null,null,null,null,null,null,null,null,null,null,null,null,null,null,null,null,null," "," ",null,null,null,""]
[null,null,null,null,null,null,null,null,null,null,null,null,null,null,null,null,null,null,null,null,null,null,null," "," ",null,null,null,""]
[null,null,null,null,null,null,null,null,null,null,null,null,null,null,null,null,null,null,null,null,null,null,null," ",{"$f":"IF(AND(F262=\"STD4-8\",G262=\"Yes\"),\"PPAP Checksheet, 5 pc dimensional layout & capability/gage studies\",IF(LEFT(F262,3)=\"STD\",\"PPAP Checksheet & 5 pc dimensional layout\",IF(F262=\"CL3\",\"PPAP Checksheet, 5pc dimensional layout, gage studies & capability studies, if required\",IF(F262=\"\",\" \",\"PPAP Checksheet, 5 pc dimensional layout & capability/gage studies\"))))","v":" "},null,null,null,""]
[null,null,null,null,null,null,null,null,null,null,null,null,null,null,null,null,null,null,null,null,null,null,null,{"$f":"IF(AND(F263=\"STD4-8\",G263=\"Yes\"),\"Cpk =/> 1.67    Ppk =/> 1.33\",IF(LEFT(F263,3)=\"STD\",\"Cpk > 1.33    Ppk > 1.33\",(IF(F263=\"CL3\",\"Cpk > 1.33    Ppk > 1.33\",IF(LEFT(F263,2)=\"CL\",\"Cpk > 1.67    Ppk > 1.67\",IF(F263=\"\",\" \",\"Cpk =/> 1.67    Ppk =/> 1.33\"))))))","v":" "}," ",null,null,null,{"$f":"IF(ISBLANK(F263),\"\",IF(IFERROR(OR(MATCH(M263,INDIRECT(SUBSTITUTE(F263,\"-\",\"_\")&\"_1\"),0),MATCH(N263,INDIRECT(SUBSTITUTE(F263,\"-\",\"_\")&\"_2\"),0),MATCH(O263,INDIRECT(SUBSTITUTE(F263,\"-\",\"_\")&\"_3\"),0),MATCH(W263,INDIRECT(SUBSTITUTE(F263,\"-\",\"_\")&\"_4\"),0)),\"R\")=\"R\",IF(V263=\"Closed & Approved\",\"G\",IF(V263=\"Mitigation Plan Approved\",\"Y\",\"R\")),\"G\"))","v":""}]
[null,null,null,null,null,null,null,null,null,null,null,null,null,null,null,null,null,null,null,null,null,null,null," "," ",null,null,null,""]
[null,null,null,null,null,null,null,null,null,null,null,null,null,null,null,null,null,null,null,null,null,null,null," "," ",null,null,null,""]
[null,null,null,null,null,null,null,null,null,null,null,null,null,null,null,null,null,null,null,null,null,null,null," "," ",null,null,null,""]
[null,null,null,null,null,null,null,null,null,null,null,null,null,null,null,null,null,null,null,null,null,null,null," "," ",null,null,null,""]
[null,null,null,null,null,null,null,null,null,null,null,null,null,null,null,null,null,null,null,null,null,null,null," "," ",null,null,null,""]
[null,null,null,null,null,null,null,null,null,null,null,null,null,null,null,null,null,null,null,null,null,null,null," "," ",null,null,null,""]
[null,null,null,null,null,null,null,null,null,null,null,null,null,null,null,null,null,null,null,null,null,null,null," "," ",null,null,null,""]
[null,null,null,null,null,null,null,null,null,null,null,null,null,null,null,null,null,null,null,null,null,null,null," "," ",null,null,null,""]
[null,null,null,null,null,null,null,null,null,null,null,null,null,null,null,null,null,null,null,null,null,null,null," "," ",null,null,null,""]
[null,null,null,null,null,null,null,null,null,null,null,null,null,null,null,null,null,null,null,null,null,null,null," "," ",null,null,null,""]
[null,null,null,null,null,null,null,null,null,null,null,null,null,null,null,null,null,null,null,null,null,null,null," "," ",null,null,null,""]
[null,null,null,null,null,null,null,null,null,null,null,null,null,null,null,null,null,null,null,null,null,null,null," "," ",null,null,null,""]
[null,null,null,null,null,null,null,null,null,null,null,null,null,null,null,null,null,null,null,null,null,null,null," "," ",null,null,null,""]
[null,null,null,null,null,null,null,null,null,null,null,null,null,null,null,null,null,null,null,null,null,null,null," "," ",null,null,null,""]
[null,null,null,null,null,null,null,null,null,null,null,null,null,null,null,null,null,null,null,null,null,null,null," "," ",null,null,null,""]
[null,null,null,null,null,null,null,null,null,null,null,null,null,null,null,null,null,null,null,null,null,null,null," "," ",null,null,null,""]
[null,null,null,null,null,null,null,null,null,null,null,null,null,null,null,null,null,null,null,null,null,null,null," "," ",null,null,null,""]
[null,null,null,null,null,null,null,null,null,null,null,null,null,null,null,null,null,null,null,null,null,null,null," "," ",null,null,null,""]
[null,null,null,null,null,null,null,null,null,null,null,null,null,null,null,null,null,null,null,null,null,null,null," "," ",null,null,null,""]
[null,null,null,null,null,null,null,null,null,null,null,null,null,null,null,null,null,null,null,null,null,null,null," "," ",null,null,null,""]
[null,null,null,null,null,null,null,null,null,null,null,null,null,null,null,null,null,null,null,null,null,null,null," "," ",null,null,null,""]
[null,null,null,null,null,null,null,null,null,null,null,null,null,null,null,null,null,null,null,null,null,null,null," "," ",null,null,null,""]
[null,null,null,null,null,null,null,null,null,null,null,null,null,null,null,null,null,null,null,null,null,null,null," "," ",null,null,null,""]
[null,null,null,null,null,null,null,null,null,null,null,null,null,null,null,null,null,null,null,null,null,null,null," "," ",null,null,null,""]
[null,null,null,null,null,null,null,null,null,null,null,null,null,null,null,null,null,null,null,null,null,null,null," "," ",null,null,null,""]
[null,null,null,null,null,null,null,null,null,null,null,null,null,null,null,null,null,null,null,null,null,null,null," "," ",null,null,null,""]
[null,null,null,null,null,null,null,null,null,null,null,null,null,null,null,null,null,null,null,null,null,null,null," "," ",null,null,null,""]
[null,null,null,null,null,null,null,null,null,null,null,null,null,null,null,null,null,null,null,null,null,null,null," "," ",null,null,null,""]
[null,null,null,null,null,null,null,null,null,null,null,null,null,null,null,null,null,null,null,null,null,null,null," "," ",null,null,null,""]
[null,null,null,null,null,null,null,null,null,null,null,null,null,null,null,null,null,null,null,null,null,null,null," "," ",null,null,null,""]
[null,null,null,null,null,null,null,null,null,null,null,null,null,null,null,null,null,null,null,null,null,null,null," "," ",null,null,null,""]
[null,null,null,null,null,null,null,null,null,null,null,null,null,null,null,null,null,null,null,null,null,null,null," "," ",null,null,null,""]
[null,null,null,null,null,null,null,null,null,null,null,null,null,null,null,null,null,null,null,null,null,null,null," "," ",null,null,null,""]
[null,null,null,null,null,null,null,null,null,null,null,null,null,null,null,null,null,null,null,null,null,null,null," "," ",null,null,null,""]
[null,null,null,null,null,null,null,null,null,null,null,null,null,null,null,null,null,null,null,null,null,null,null," "," ",null,null,null,""]
[null,null,null,null,null,null,null,null,null,null,null,null,null,null,null,null,null,null,null,null,null,null,null," "," ",null,null,null,""]
[null,null,null,null,null,null,null,null,null,null,null,null,null,null,null,null,null,null,null,null,null,null,null," "," ",null,null,null,""]
[null,null,null,null,null,null,null,null,null,null,null,null,null,null,null,null,null,null,null,null,null,null,null," "," ",null,null,null,""]
[null,null,null,null,null,null,null,null,null,null,null,null,null,null,null,null,null,null,null,null,null,null,null," "," ",null,null,null,""]
[null,null,null,null,null,null,null,null,null,null,null,null,null,null,null,null,null,null,null,null,null,null,null," "," ",null,null,null,""]
[null,null,null,null,null,null,null,null,null,null,null,null,null,null,null,null,null,null,null,null,null,null,null," "," ",null,null,null,""]
[null,null,null,null,null,null,null,null,null,null,null,null,null,null,null,null,null,null,null,null,null,null,null," "," ",null,null,null,""]
[null,null,null,null,null,null,null,null,null,null,null,null,null,null,null,null,null,null,null,null,null,null,null," "," ",null,null,null,""]
[null,null,null,null,null,null,null,null,null,null,null,null,null,null,null,null,null,null,null,null,null,null,null," "," ",null,null,null,""]
[null,null,null,null,null,null,null,null,null,null,null,null,null,null,null,null,null,null,null,null,null,null,null," "," ",null,null,null,""]
[null,null,null,null,null,null,null,null,null,null,null,null,null,null,null,null,null,null,null,null,null,null,null," "," ",null,null,null,""]
[null,null,null,null,null,null,null,null,null,null,null,null,null,null,null,null,null,null,null,null,null,null,null," "," ",null,null,null,""]
[null,null,null,null,null,null,null,null,null,null,null,null,null,null,null,null,null,null,null,null,null,null,null," "," ",null,null,null,""]
[null,null,null,null,null,null,null,null,null,null,null,null,null,null,null,null,null,null,null,null,null,null,null," "," ",null,null,null,""]
[null,null,null,null,null,null,null,null,null,null,null,null,null,null,null,null,null,null,null,null,null,null,null," "," ",null,null,null,""]
[null,null,null,null,null,null,null,null,null,null,null,null,null,null,null,null,null,null,null,null,null,null,null," "," ",null,null,null,""]
[null,null,null,null,null,null,null,null,null,null,null,null,null,null,null,null,null,null,null,null,null,null,null," "," ",null,null,null,""]
[null,null,null,null,null,null,null,null,null,null,null,null,null,null,null,null,null,null,null,null,null,null,null," "," ",null,null,null,""]
[null,null,null,null,null,null,null,null,null,null,null,null,null,null,null,null,null,null,null,null,null,null,null," "," ",null,null,null,""]
[null,null,null,null,null,null,null,null,null,null,null,null,null,null,null,null,null,null,null,null,null,null,null," "," ",null,null,null,""]
[null,null,null,null,null,null,null,null,null,null,null,null,null,null,null,null,null,null,null,null,null,null,null," "," ",null,null,null,""]
[null,null,null,null,null,null,null,null,null,null,null,null,null,null,null,null,null,null,null,null,null,null,null," "," ",null,null,null,""]
[null,null,null,null,null,null,null,null,null,null,null,null,null,null,null,null,null,null,null,null,null,null,null," "," ",null,null,null,""]
[null,null,null,null,null,null,null,null,null,null,null,null,null,null,null,null,null,null,null,null,null,null,null," "," ",null,null,null,""]
[null,null,null,null,null,null,null,null,null,null,null,null,null,null,null,null,null,null,null,null,null,null,null," "," ",null,null,null,""]
[null,null,null,null,null,null,null,null,null,null,null,null,null,null,null,null,null,null,null,null,null,null,null," "," ",null,null,null,""]
[null,null,null,null,null,null,null,null,null,null,null,null,null,null,null,null,null,null,null,null,null,null,null," "," ",null,null,null,""]
[null,null,null,null,null,null,null,null,null,null,null,null,null,null,null,null,null,null,null,null,null,null,null," ",{"$f":"IF(AND(F326=\"STD4-8\",G326=\"Yes\"),\"PPAP Checksheet, 5 pc dimensional layout & capability/gage studies\",IF(LEFT(F326,3)=\"STD\",\"PPAP Checksheet & 5 pc dimensional layout\",IF(F326=\"CL3\",\"PPAP Checksheet, 5pc dimensional layout, gage studies & capability studies, if required\",IF(F326=\"\",\" \",\"PPAP Checksheet, 5 pc dimensional layout & capability/gage studies\"))))","v":" "},null,null,null,""]
[null,null,null,null,null,null,null,null,null,null,null,null,null,null,null,null,null,null,null,null,null,null,null,{"$f":"IF(AND(F327=\"STD4-8\",G327=\"Yes\"),\"Cpk =/> 1.67    Ppk =/> 1.33\",IF(LEFT(F327,3)=\"STD\",\"Cpk > 1.33    Ppk > 1.33\",(IF(F327=\"CL3\",\"Cpk > 1.33    Ppk > 1.33\",IF(LEFT(F327,2)=\"CL\",\"Cpk > 1.67    Ppk > 1.67\",IF(F327=\"\",\" \",\"Cpk =/> 1.67    Ppk =/> 1.33\"))))))","v":" "}," ",null,null,null,{"$f":"IF(ISBLANK(F327),\"\",IF(IFERROR(OR(MATCH(M327,INDIRECT(SUBSTITUTE(F327,\"-\",\"_\")&\"_1\"),0),MATCH(N327,INDIRECT(SUBSTITUTE(F327,\"-\",\"_\")&\"_2\"),0),MATCH(O327,INDIRECT(SUBSTITUTE(F327,\"-\",\"_\")&\"_3\"),0),MATCH(W327,INDIRECT(SUBSTITUTE(F327,\"-\",\"_\")&\"_4\"),0)),\"R\")=\"R\",IF(V327=\"Closed & Approved\",\"G\",IF(V327=\"Mitigation Plan Approved\",\"Y\",\"R\")),\"G\"))","v":""}]
[null,null,null,null,null,null,null,null,null,null,null,null,null,null,null,null,null,null,null,null,null,null,null," "," ",null,null,null,""]
[null,null,null,null,null,null,null,null,null,null,null,null,null,null,null,null,null,null,null,null,null,null,null," "," ",null,null,null,""]
[null,null,null,null,null,null,null,null,null,null,null,null,null,null,null,null,null,null,null,null,null,null,null," "," ",null,null,null,""]
[null,null,null,null,null,null,null,null,null,null,null,null,null,null,null,null,null,null,null,null,null,null,null," "," ",null,null,null,""]
[null,null,null,null,null,null,null,null,null,null,null,null,null,null,null,null,null,null,null,null,null,null,null," "," ",null,null,null,""]
[null,null,null,null,null,null,null,null,null,null,null,null,null,null,null,null,null,null,null,null,null,null,null," "," ",null,null,null,""]
[null,null,null,null,null,null,null,null,null,null,null,null,null,null,null,null,null,null,null,null,null,null,null," "," ",null,null,null,""]

{"sheet":"SCS List","index":11,"n_rows":339,"n_cols":49,"rows_kept":339,"cut":false,"hidden":true,"merged":[[327,1,327,2],[329,1,329,2],[330,1,330,2],[331,1,331,2],[332,1,332,2],[336,1,336,2],[318,1,318,2],[319,1,319,2],[320,1,320,2],[321,1,321,2],[322,1,322,2],[323,1,323,2],[324,1,324,2],[325,1,325,2],[326,1,326,2],[338,1,338,2],[8,8,9,8],[8,22,8,29],[317,1,317,2],[328,1,328,2],[333,1,333,2],[334,1,334,2],[335,1,335,2],[337,1,337,2],[311,1,311,2],[312,1,312,2],[313,1,313,2],[314,1,314,2],[315,1,315,2],[316,1,316,2],[305,1,305,2],[306,1,306,2],[307,1,307,2],[308,1,308,2],[309,1,309,2],[310,1,310,2],[299,1,299,2],[300,1,300,2],[301,1,301,2],[302,1,302,2],[303,1,303,2],[304,1,304,2],[293,1,293,2],[294,1,294,2],[295,1,295,2],[296,1,296,2],[297,1,297,2],[298,1,298,2],[287,1,287,2],[288,1,288,2],[289,1,289,2],[290,1,290,2],[291,1,291,2],[292,1,292,2],[281,1,281,2],[282,1,282,2],[283,1,283,2],[284,1,284,2],[285,1,285,2],[286,1,286,2],[275,1,275,2],[276,1,276,2],[277,1,277,2],[278,1,278,2],[279,1,279,2],[280,1,280,2],[269,1,269,2],[270,1,270,2],[271,1,271,2],[272,1,272,2],[273,1,273,2],[274,1,274,2],[263,1,263,2],[264,1,264,2],[265,1,265,2],[266,1,266,2],[267,1,267,2],[268,1,268,2],[257,1,257,2],[258,1,258,2],[259,1,259,2],[260,1,260,2],[261,1,261,2],[262,1,262,2],[251,1,251,2],[252,1,252,2],[253,1,253,2],[254,1,254,2],[255,1,255,2],[256,1,256,2],[245,1,245,2],[246,1,246,2],[247,1,247,2],[248,1,248,2],[249,1,249,2],[250,1,250,2],[239,1,239,2],[240,1,240,2],[241,1,241,2],[242,1,242,2],[243,1,243,2],[244,1,244,2],[233,1,233,2],[234,1,234,2],[235,1,235,2],[236,1,236,2],[237,1,237,2],[238,1,238,2],[227,1,227,2],[228,1,228,2],[229,1,229,2],[230,1,230,2],[231,1,231,2],[232,1,232,2],[221,1,221,2],[222,1,222,2],[223,1,223,2],[224,1,224,2],[225,1,225,2],[226,1,226,2],[215,1,215,2],[216,1,216,2],[217,1,217,2],[218,1,218,2],[219,1,219,2],[220,1,220,2],[209,1,209,2],[210,1,210,2],[211,1,211,2],[212,1,212,2],[213,1,213,2],[214,1,214,2],[203,1,203,2],[204,1,204,2],[205,1,205,2],[206,1,206,2],[207,1,207,2],[208,1,208,2],[197,1,197,2],[198,1,198,2],[199,1,199,2],[200,1,200,2],[201,1,201,2],[202,1,202,2],[191,1,191,2],[192,1,192,2],[193,1,193,2],[194,1,194,2],[195,1,195,2],[196,1,196,2],[185,1,185,2],[186,1,186,2],[187,1,187,2],[188,1,188,2],[189,1,189,2],[190,1,190,2],[179,1,179,2],[180,1,180,2],[181,1,181,2],[182,1,182,2],[183,1,183,2],[184,1,184,2],[173,1,173,2],[174,1,174,2],[175,1,175,2],[176,1,176,2],[177,1,177,2],[178,1,178,2],[167,1,167,2],[168,1,168,2],[169,1,169,2],[170,1,170,2],[171,1,171,2],[172,1,172,2],[161,1,161,2],[162,1,162,2],[163,1,163,2],[164,1,164,2],[165,1,165,2],[166,1,166,2],[155,1,155,2],[156,1,156,2],[157,1,157,2],[158,1,158,2],[159,1,159,2],[160,1,160,2],[149,1,149,2],[150,1,150,2],[151,1,151,2],[152,1,152,2],[153,1,153,2],[154,1,154,2],[143,1,143,2],[144,1,144,2],[145,1,145,2],[146,1,146,2],[147,1,147,2],[148,1,148,2],[137,1,137,2],[138,1,138,2],[139,1,139,2],[140,1,140,2],[141,1,141,2],[142,1,142,2],[131,1,131,2],[132,1,132,2],[133,1,133,2],[134,1,134,2],[135,1,135,2],[136,1,136,2],[125,1,125,2],[126,1,126,2],[127,1,127,2],[128,1,128,2],[129,1,129,2],[130,1,130,2],[119,1,119,2],[120,1,120,2],[121,1,121,2],[122,1,122,2],[123,1,123,2],[124,1,124,2],[113,1,113,2],[114,1,114,2],[115,1,115,2],[116,1,116,2],[117,1,117,2],[118,1,118,2],[107,1,107,2],[108,1,108,2],[109,1,109,2],[110,1,110,2],[111,1,111,2],[112,1,112,2],[101,1,101,2],[102,1,102,2],[103,1,103,2],[104,1,104,2],[105,1,105,2],[106,1,106,2],[95,1,95,2],[96,1,96,2],[97,1,97,2],[98,1,98,2],[99,1,99,2],[100,1,100,2],[89,1,89,2],[90,1,90,2],[91,1,91,2],[92,1,92,2],[93,1,93,2],[94,1,94,2],[83,1,83,2],[84,1,84,2],[85,1,85,2],[86,1,86,2],[87,1,87,2],[88,1,88,2],[77,1,77,2],[78,1,78,2],[79,1,79,2],[80,1,80,2],[81,1,81,2],[82,1,82,2],[71,1,71,2],[72,1,72,2],[73,1,73,2],[74,1,74,2],[75,1,75,2],[76,1,76,2],[65,1,65,2],[66,1,66,2],[67,1,67,2],[68,1,68,2],[69,1,69,2],[70,1,70,2],[59,1,59,2],[60,1,60,2],[61,1,61,2],[62,1,62,2],[63,1,63,2],[64,1,64,2],[53,1,53,2],[54,1,54,2],[55,1,55,2],[56,1,56,2],[57,1,57,2],[58,1,58,2],[47,1,47,2],[48,1,48,2],[49,1,49,2],[50,1,50,2],[51,1,51,2],[52,1,52,2],[41,1,41,2],[42,1,42,2],[43,1,43,2],[44,1,44,2],[45,1,45,2],[46,1,46,2],[35,1,35,2],[36,1,36,2],[37,1,37,2],[38,1,38,2],[39,1,39,2],[40,1,40,2],[29,1,29,2],[30,1,30,2],[31,1,31,2],[32,1,32,2],[33,1,33,2],[34,1,34,2],[23,1,23,2],[24,1,24,2],[25,1,25,2],[26,1,26,2],[27,1,27,2],[28,1,28,2],[17,1,17,2],[18,1,18,2],[19,1,19,2],[20,1,20,2],[21,1,21,2],[22,1,22,2],[11,1,11,2],[12,1,12,2],[13,1,13,2],[14,1,14,2],[15,1,15,2],[16,1,16,2],[8,44,9,44],[8,45,9,45],[8,46,9,46],[10,1,10,2],[8,30,9,30],[8,31,9,31],[8,32,9,32],[8,33,9,33],[8,34,8,43],[8,11,9,11],[8,12,9,12],[8,13,8,15],[8,16,9,16],[8,17,8,19],[8,20,8,21],[4,29,4,30],[7,31,7,48],[8,0,9,0],[8,1,9,2],[8,3,9,3],[8,4,9,4],[8,5,9,5],[8,6,9,6],[8,7,9,7],[8,9,9,9],[8,10,9,10],[8,47,9,47],[8,48,9,48],[0,0,0,30],[0,31,0,48],[1,0,1,2],[1,4,1,16],[1,17,1,30],[1,31,6,48],[2,0,2,2],[2,4,2,16],[2,17,2,30],[3,0,3,3],[5,0,5,3],[5,4,5,16],[5,17,5,28],[5,29,5,30],[6,0,6,3],[6,4,6,16],[6,17,6,28],[6,29,6,30],[3,4,3,16],[3,17,3,28],[3,29,3,30],[4,0,4,3],[4,4,4,16],[4,17,4,28]]}
["SUPPLIER CHARACTERISTIC SUMMARY",null,null,null,null,null,null,null,null,null,null,null,null,null,null,null,null,null,null,null,null,null,null,null,null,null,null,null,null,null,null,"SCS - TRACEABILITY"]
["Part Number",null,null,"Rev Level","Supplier Contact (Quality Dept):",null,null,null,null,null,null,null,null,null,null,null,null,"AQE / SQE:"]
[{"$f":"IF('1-Program Info'!B5=\"[Enter PN Here]\",\"See Tab 1\",'1-Program Info'!B5)","v":"See Tab 1"},null,null,{"$f":"IF('1-Program Info'!B7=\"[Enter Drwg Rev Here]\",\"See Tab 1\",'1-Program Info'!B7)","v":"See Tab 1"},{"$f":"IF('2-Supplier Information'!B10=\"[Enter Name]\",\"None Entered\",'2-Supplier Information'!B10)","v":"None Entered"},null,null,null,null,null,null,null,null,null,null,null,null,{"$f":"IF('1-Program Info'!C50=\"[Enter Name]\",\"See Tab 1\",'1-Program Info'!C50)","v":"See Tab 1"}]
["Part Name / Description",null,null,null,"Contact Phone:",null,null,null,null,null,null,null,null,null,null,null,null,"Project / Program:",null,null,null,null,null,null,null,null,null,null,null,"Date Created:"]
[{"$f":"IF('1-Program Info'!B3=\"[Enter Part Name Here]\",\"See Tab 1\",'1-Program Info'!B3)","v":"See Tab 1"},null,null,null,{"$f":"IF('2-Supplier Information'!D10=\"[Enter Phone #]\",\"None Entered\",'2-Supplier Information'!D10)","v":"None Entered"}]
["Supplier Name",null,null,null,"Supplier Manufacturing Location:",null,null,null,null,null,null,null,null,null,null,null,null,"EPC Launch Period:",null,null,null,null,null,null,null,null,null,null,null,"Date Revised:"]
[{"$f":"IF('2-Supplier Information'!B3=\"[Enter Supplier Name Here]\",\"See Tab 2\",'2-Supplier Information'!B3)","v":"See Tab 2"},null,null,null,{"$f":"IF('2-Supplier Information'!B3=\"[Enter Supplier Name Here]\",\"None Entered\",\"DUNS: \"&'2-Supplier Information'!B4&\" Country: \"&'2-Supplier Information'!B6)","v":"None Entered"}]
[null,null,null,null,null,null,null,null,null,null,null,null,null,null,null,null,null,null,null,null,null,null,null,null,null,null,null,null,null,null,null,"Traceability Information"]
["Road Map #","Product Characteristic\nDescription",null,"Dimension & Tolerance (with units)","Class","PT","Lesson Learn Input","EPC\n(Y/N)?","SPC control & ongoing capability study in EPC phase ","Require Measurement Correlation\n (Y/N)?","In DFMEA\n(Y, N or N/A)?","In PFD (Y/N)?","In PFMEA (Y/N)?","Error Proofing",null,null,"Device Manual or Automated?","Production Process Control Plan",null,null,"Measurement System Analysis",null,"Initial Capability Study Data\n(Variable Data)",null,null,null,null,null,null,null,"Action Plan to resolve issues identified for a characteristic in this form\n\n(include action, name, date, completed)","Traceability Type","Traceability Location","Marking Type","Marking Content",null,null,null,null,null,null,null,null,null,"Lot Size","Traceability\nRecord","Linkage to Traceability  System","Traceability Origin","REMARKS /\nAction Plan to resolve issues identified for a characteristic in this form"]
[null,null,null,null,null,null,null,null,null,null,null,null,null,"Describe the 100% Error-Proofing Method (enter \"none\" if no EP is planned)","Error-Proof Verification Method/ Freq\n(or N/A)","P\nor\nD",null,"Measurement Device Name","Control Method","Sampling\nPlan","Variable\n(%)","Attribute\n(kappa)","Initial Capability for PPAP","Sample Size of Cap. Study","Chart Type","Process Stability\nDemonstrated on Control Chart Y/N?","Ppk","Pp","Cpk","Cp",null,null,null,null,"Characterisitic Results","Part Consecutive #","Production Time","Production Date","Production Shift","Machine / Line / Tool #","Tool Cavity #","Pass / Fail","Other (please Specifiy)","Not Applicable"]
[{"$f":"IF(ISBLANK('8-Process Controls'!C6),\"\",'8-Process Controls'!C6)","v":""},{"$f":"IF(ISBLANK('8-Process Controls'!D6),\"\",'8-Process Controls'!D6)","v":""},null,{"$f":"IF(ISBLANK('8-Process Controls'!E6),\"\",'8-Process Controls'!E6)","v":""},{"$f":"IF(ISBLANK('8-Process Controls'!F6),\"\",'8-Process Controls'!F6)","v":""},{"$f":"IF(ISBLANK('8-Process Controls'!G6),\"\",IF(LEFT('8-Process Controls'!G6,1)=\"Y\",\"PT\",\"\"))","v":""},null,{"$f":"IF(ISBLANK('8-Process Controls'!S6),\"\",'8-Process Controls'!S6)","v":""},{"$f":"IF(ISBLANK('8-Process Controls'!T6),\"\",'8-Process Controls'!T6)","v":""},null,null,null,null,null,null,null,null,null,null,null,null,null,{"$f":"IF(ISBLANK('8-Process Controls'!U6),\"\",'8-Process Controls'!U6)","v":""}]
[{"$f":"IF(ISBLANK('8-Process Controls'!C7),\"\",'8-Process Controls'!C7)","v":""},{"$f":"IF(ISBLANK('8-Process Controls'!D7),\"\",'8-Process Controls'!D7)","v":""},null,{"$f":"IF(ISBLANK('8-Process Controls'!E7),\"\",'8-Process Controls'!E7)","v":""},{"$f":"IF(ISBLANK('8-Process Controls'!F7),\"\",'8-Process Controls'!F7)","v":""},{"$f":"IF(ISBLANK('8-Process Controls'!G7),\"\",IF(LEFT('8-Process Controls'!G7,1)=\"Y\",\"PT\",\"\"))","v":""},null,{"$f":"IF(ISBLANK('8-Process Controls'!S7),\"\",'8-Process Controls'!S7)","v":""},{"$f":"IF(ISBLANK('8-Process Controls'!T7),\"\",'8-Process Controls'!T7)","v":""},null,null,null,null,null,null,null,null,null,null,null,null,null,{"$f":"IF(ISBLANK('8-Process Controls'!U7),\"\",'8-Process Controls'!U7)","v":""}]
[{"$f":"IF(ISBLANK('8-Process Controls'!C8),\"\",'8-Process Controls'!C8)","v":""},{"$f":"IF(ISBLANK('8-Process Controls'!D8),\"\",'8-Process Controls'!D8)","v":""},null,{"$f":"IF(ISBLANK('8-Process Controls'!E8),\"\",'8-Process Controls'!E8)","v":""},{"$f":"IF(ISBLANK('8-Process Controls'!F8),\"\",'8-Process Controls'!F8)","v":""},{"$f":"IF(ISBLANK('8-Process Controls'!G8),\"\",IF(LEFT('8-Process Controls'!G8,1)=\"Y\",\"PT\",\"\"))","v":""},null,{"$f":"IF(ISBLANK('8-Process Controls'!S8),\"\",'8-Process Controls'!S8)","v":""},{"$f":"IF(ISBLANK('8-Process Controls'!T8),\"\",'8-Process Controls'!T8)","v":""},null,null,null,null,null,null,null,null,null,null,null,null,null,{"$f":"IF(ISBLANK('8-Process Controls'!U8),\"\",'8-Process Controls'!U8)","v":""}]
[{"$f":"IF(ISBLANK('8-Process Controls'!C9),\"\",'8-Process Controls'!C9)","v":""},{"$f":"IF(ISBLANK('8-Process Controls'!D9),\"\",'8-Process Controls'!D9)","v":""},null,{"$f":"IF(ISBLANK('8-Process Controls'!E9),\"\",'8-Process Controls'!E9)","v":""},{"$f":"IF(ISBLANK('8-Process Controls'!F9),\"\",'8-Process Controls'!F9)","v":""},{"$f":"IF(ISBLANK('8-Process Controls'!G9),\"\",IF(LEFT('8-Process Controls'!G9,1)=\"Y\",\"PT\",\"\"))","v":""},null,{"$f":"IF(ISBLANK('8-Process Controls'!S9),\"\",'8-Process Controls'!S9)","v":""},{"$f":"IF(ISBLANK('8-Process Controls'!T9),\"\",'8-Process Controls'!T9)","v":""},null,null,null,null,null,null,null,null,null,null,null,null,null,{"$f":"IF(ISBLANK('8-Process Controls'!U9),\"\",'8-Process Controls'!U9)","v":""}]
[{"$f":"IF(ISBLANK('8-Process Controls'!C10),\"\",'8-Process Controls'!C10)","v":""},{"$f":"IF(ISBLANK('8-Process Controls'!D10),\"\",'8-Process Controls'!D10)","v":""},null,{"$f":"IF(ISBLANK('8-Process Controls'!E10),\"\",'8-Process Controls'!E10)","v":""},{"$f":"IF(ISBLANK('8-Process Controls'!F10),\"\",'8-Process Controls'!F10)","v":""},{"$f":"IF(ISBLANK('8-Process Controls'!G10),\"\",IF(LEFT('8-Process Controls'!G10,1)=\"Y\",\"PT\",\"\"))","v":""},null,{"$f":"IF(ISBLANK('8-Process Controls'!S10),\"\",'8-Process Controls'!S10)","v":""},{"$f":"IF(ISBLANK('8-Process Controls'!T10),\"\",'8-Process Controls'!T10)","v":""},null,null,null,null,null,null,null,null,null,null,null,null,null,{"$f":"IF(ISBLANK('8-Process Controls'!U10),\"\",'8-Process Controls'!U10)","v":""}]
[{"$f":"IF(ISBLANK('8-Process Controls'!C11),\"\",'8-Process Controls'!C11)","v":""},{"$f":"IF(ISBLANK('8-Process Controls'!D11),\"\",'8-Process Controls'!D11)","v":""},null,{"$f":"IF(ISBLANK('8-Process Controls'!E11),\"\",'8-Process Controls'!E11)","v":""},{"$f":"IF(ISBLANK('8-Process Controls'!F11),\"\",'8-Process Controls'!F11)","v":""},{"$f":"IF(ISBLANK('8-Process Controls'!G11),\"\",IF(LEFT('8-Process Controls'!G11,1)=\"Y\",\"PT\",\"\"))","v":""},null,{"$f":"IF(ISBLANK('8-Process Controls'!S11),\"\",'8-Process Controls'!S11)","v":""},{"$f":"IF(ISBLANK('8-Process Controls'!T11),\"\",'8-Process Controls'!T11)","v":""},null,null,null,null,null,null,null,null,null,null,null,null,null,{"$f":"IF(ISBLANK('8-Process Controls'!U11),\"\",'8-Process Controls'!U11)","v":""}]
[{"$f":"IF(ISBLANK('8-Process Controls'!C12),\"\",'8-Process Controls'!C12)","v":""},{"$f":"IF(ISBLANK('8-Process Controls'!D12),\"\",'8-Process Controls'!D12)","v":""},null,{"$f":"IF(ISBLANK('8-Process Controls'!E12),\"\",'8-Process Controls'!E12)","v":""},{"$f":"IF(ISBLANK('8-Process Controls'!F12),\"\",'8-Process Controls'!F12)","v":""},{"$f":"IF(ISBLANK('8-Process Controls'!G12),\"\",IF(LEFT('8-Process Controls'!G12,1)=\"Y\",\"PT\",\"\"))","v":""},null,{"$f":"IF(ISBLANK('8-Process Controls'!S12),\"\",'8-Process Controls'!S12)","v":""},{"$f":"IF(ISBLANK('8-Process Controls'!T12),\"\",'8-Process Controls'!T12)","v":""},null,null,null,null,null,null,null,null,null,null,null,null,null,{"$f":"IF(ISBLANK('8-Process Controls'!U12),\"\",'8-Process Controls'!U12)","v":""}]
[{"$f":"IF(ISBLANK('8-Process Controls'!C13),\"\",'8-Process Controls'!C13)","v":""},{"$f":"IF(ISBLANK('8-Process Controls'!D13),\"\",'8-Process Controls'!D13)","v":""},null,{"$f":"IF(ISBLANK('8-Process Controls'!E13),\"\",'8-Process Controls'!E13)","v":""},{"$f":"IF(ISBLANK('8-Process Controls'!F13),\"\",'8-Process Controls'!F13)","v":""},{"$f":"IF(ISBLANK('8-Process Controls'!G13),\"\",IF(LEFT('8-Process Controls'!G13,1)=\"Y\",\"PT\",\"\"))","v":""},null,{"$f":"IF(ISBLANK('8-Process Controls'!S13),\"\",'8-Process Controls'!S13)","v":""},{"$f":"IF(ISBLANK('8-Process Controls'!T13),\"\",'8-Process Controls'!T13)","v":""},null,null,null,null,null,null,null,null,null,null,null,null,null,{"$f":"IF(ISBLANK('8-Process Controls'!U13),\"\",'8-Process Controls'!U13)","v":""}]
[{"$f":"IF(ISBLANK('8-Process Controls'!C14),\"\",'8-Process Controls'!C14)","v":""},{"$f":"IF(ISBLANK('8-Process Controls'!D14),\"\",'8-Process Controls'!D14)","v":""},null,{"$f":"IF(ISBLANK('8-Process Controls'!E14),\"\",'8-Process Controls'!E14)","v":""},{"$f":"IF(ISBLANK('8-Process Controls'!F14),\"\",'8-Process Controls'!F14)","v":""},{"$f":"IF(ISBLANK('8-Process Controls'!G14),\"\",IF(LEFT('8-Process Controls'!G14,1)=\"Y\",\"PT\",\"\"))","v":""},null,{"$f":"IF(ISBLANK('8-Process Controls'!S14),\"\",'8-Process Controls'!S14)","v":""},{"$f":"IF(ISBLANK('8-Process Controls'!T14),\"\",'8-Process Controls'!T14)","v":""},null,null,null,null,null,null,null,null,null,null,null,null,null,{"$f":"IF(ISBLANK('8-Process Controls'!U14),\"\",'8-Process Controls'!U14)","v":""}]
[{"$f":"IF(ISBLANK('8-Process Controls'!C15),\"\",'8-Process Controls'!C15)","v":""},{"$f":"IF(ISBLANK('8-Process Controls'!D15),\"\",'8-Process Controls'!D15)","v":""},null,{"$f":"IF(ISBLANK('8-Process Controls'!E15),\"\",'8-Process Controls'!E15)","v":""},{"$f":"IF(ISBLANK('8-Process Controls'!F15),\"\",'8-Process Controls'!F15)","v":""},{"$f":"IF(ISBLANK('8-Process Controls'!G15),\"\",IF(LEFT('8-Process Controls'!G15,1)=\"Y\",\"PT\",\"\"))","v":""},null,{"$f":"IF(ISBLANK('8-Process Controls'!S15),\"\",'8-Process Controls'!S15)","v":""},{"$f":"IF(ISBLANK('8-Process Controls'!T15),\"\",'8-Process Controls'!T15)","v":""},null,null,null,null,null,null,null,null,null,null,null,null,null,{"$f":"IF(ISBLANK('8-Process Controls'!U15),\"\",'8-Process Controls'!U15)","v":""}]
[{"$f":"IF(ISBLANK('8-Process Controls'!C16),\"\",'8-Process Controls'!C16)","v":""},{"$f":"IF(ISBLANK('8-Process Controls'!D16),\"\",'8-Process Controls'!D16)","v":""},null,{"$f":"IF(ISBLANK('8-Process Controls'!E16),\"\",'8-Process Controls'!E16)","v":""},{"$f":"IF(ISBLANK('8-Process Controls'!F16),\"\",'8-Process Controls'!F16)","v":""},{"$f":"IF(ISBLANK('8-Process Controls'!G16),\"\",IF(LEFT('8-Process Controls'!G16,1)=\"Y\",\"PT\",\"\"))","v":""},null,{"$f":"IF(ISBLANK('8-Process Controls'!S16),\"\",'8-Process Controls'!S16)","v":""},{"$f":"IF(ISBLANK('8-Process Controls'!T16),\"\",'8-Process Controls'!T16)","v":""},null,null,null,null,null,null,null,null,null,null,null,null,null,{"$f":"IF(ISBLANK('8-Process Controls'!U16),\"\",'8-Process Controls'!U16)","v":""}]
[{"$f":"IF(ISBLANK('8-Process Controls'!C17),\"\",'8-Process Controls'!C17)","v":""},{"$f":"IF(ISBLANK('8-Process Controls'!D17),\"\",'8-Process Controls'!D17)","v":""},null,{"$f":"IF(ISBLANK('8-Process Controls'!E17),\"\",'8-Process Controls'!E17)","v":""},{"$f":"IF(ISBLANK('8-Process Controls'!F17),\"\",'8-Process Controls'!F17)","v":""},{"$f":"IF(ISBLANK('8-Process Controls'!G17),\"\",IF(LEFT('8-Process Controls'!G17,1)=\"Y\",\"PT\",\"\"))","v":""},null,{"$f":"IF(ISBLANK('8-Process Controls'!S17),\"\",'8-Process Controls'!S17)","v":""},{"$f":"IF(ISBLANK('8-Process Controls'!T17),\"\",'8-Process Controls'!T17)","v":""},null,null,null,null,null,null,null,null,null,null,null,null,null,{"$f":"IF(ISBLANK('8-Process Controls'!U17),\"\",'8-Process Controls'!U17)","v":""}]
[{"$f":"IF(ISBLANK('8-Process Controls'!C18),\"\",'8-Process Controls'!C18)","v":""},{"$f":"IF(ISBLANK('8-Process Controls'!D18),\"\",'8-Process Controls'!D18)","v":""},null,{"$f":"IF(ISBLANK('8-Process Controls'!E18),\"\",'8-Process Controls'!E18)","v":""},{"$f":"IF(ISBLANK('8-Process Controls'!F18),\"\",'8-Process Controls'!F18)","v":""},{"$f":"IF(ISBLANK('8-Process Controls'!G18),\"\",IF(LEFT('8-Process Controls'!G18,1)=\"Y\",\"PT\",\"\"))","v":""},null,{"$f":"IF(ISBLANK('8-Process Controls'!S18),\"\",'8-Process Controls'!S18)","v":""},{"$f":"IF(ISBLANK('8-Process Controls'!T18),\"\",'8-Process Controls'!T18)","v":""},null,null,null,null,null,null,null,null,null,null,null,null,null,{"$f":"IF(ISBLANK('8-Process Controls'!U18),\"\",'8-Process Controls'!U18)","v":""}]
[{"$f":"IF(ISBLANK('8-Process Controls'!C19),\"\",'8-Process Controls'!C19)","v":""},{"$f":"IF(ISBLANK('8-Process Controls'!D19),\"\",'8-Process Controls'!D19)","v":""},null,{"$f":"IF(ISBLANK('8-Process Controls'!E19),\"\",'8-Process Controls'!E19)","v":""},{"$f":"IF(ISBLANK('8-Process Controls'!F19),\"\",'8-Process Controls'!F19)","v":""},{"$f":"IF(ISBLANK('8-Process Controls'!G19),\"\",IF(LEFT('8-Process Controls'!G19,1)=\"Y\",\"PT\",\"\"))","v":""},null,{"$f":"IF(ISBLANK('8-Process Controls'!S19),\"\",'8-Process Controls'!S19)","v":""},{"$f":"IF(ISBLANK('8-Process Controls'!T19),\"\",'8-Process Controls'!T19)","v":""},null,null,null,null,null,null,null,null,null,null,null,null,null,{"$f":"IF(ISBLANK('8-Process Controls'!U19),\"\",'8-Process Controls'!U19)","v":""}]
[{"$f":"IF(ISBLANK('8-Process Controls'!C20),\"\",'8-Process Controls'!C20)","v":""},{"$f":"IF(ISBLANK('8-Process Controls'!D20),\"\",'8-Process Controls'!D20)","v":""},null,{"$f":"IF(ISBLANK('8-Process Controls'!E20),\"\",'8-Process Controls'!E20)","v":""},{"$f":"IF(ISBLANK('8-Process Controls'!F20),\"\",'8-Process Controls'!F20)","v":""},{"$f":"IF(ISBLANK('8-Process Controls'!G20),\"\",IF(LEFT('8-Process Controls'!G20,1)=\"Y\",\"PT\",\"\"))","v":""},null,{"$f":"IF(ISBLANK('8-Process Controls'!S20),\"\",'8-Process Controls'!S20)","v":""},{"$f":"IF(ISBLANK('8-Process Controls'!T20),\"\",'8-Process Controls'!T20)","v":""},null,null,null,null,null,null,null,null,null,null,null,null,null,{"$f":"IF(ISBLANK('8-Process Controls'!U20),\"\",'8-Process Controls'!U20)","v":""}]
[{"$f":"IF(ISBLANK('8-Process Controls'!C21),\"\",'8-Process Controls'!C21)","v":""},{"$f":"IF(ISBLANK('8-Process Controls'!D21),\"\",'8-Process Controls'!D21)","v":""},null,{"$f":"IF(ISBLANK('8-Process Controls'!E21),\"\",'8-Process Controls'!E21)","v":""},{"$f":"IF(ISBLANK('8-Process Controls'!F21),\"\",'8-Process Controls'!F21)","v":""},{"$f":"IF(ISBLANK('8-Process Controls'!G21),\"\",IF(LEFT('8-Process Controls'!G21,1)=\"Y\",\"PT\",\"\"))","v":""},null,{"$f":"IF(ISBLANK('8-Process Controls'!S21),\"\",'8-Process Controls'!S21)","v":""},{"$f":"IF(ISBLANK('8-Process Controls'!T21),\"\",'8-Process Controls'!T21)","v":""},null,null,null,null,null,null,null,null,null,null,null,null,null,{"$f":"IF(ISBLANK('8-Process Controls'!U21),\"\",'8-Process Controls'!U21)","v":""}]
[{"$f":"IF(ISBLANK('8-Process Controls'!C22),\"\",'8-Process Controls'!C22)","v":""},{"$f":"IF(ISBLANK('8-Process Controls'!D22),\"\",'8-Process Controls'!D22)","v":""},null,{"$f":"IF(ISBLANK('8-Process Controls'!E22),\"\",'8-Process Controls'!E22)","v":""},{"$f":"IF(ISBLANK('8-Process Controls'!F22),\"\",'8-Process Controls'!F22)","v":""},{"$f":"IF(ISBLANK('8-Process Controls'!G22),\"\",IF(LEFT('8-Process Controls'!G22,1)=\"Y\",\"PT\",\"\"))","v":""},null,{"$f":"IF(ISBLANK('8-Process Controls'!S22),\"\",'8-Process Controls'!S22)","v":""},{"$f":"IF(ISBLANK('8-Process Controls'!T22),\"\",'8-Process Controls'!T22)","v":""},null,null,null,null,null,null,null,null,null,null,null,null,null,{"$f":"IF(ISBLANK('8-Process Controls'!U22),\"\",'8-Process Controls'!U22)","v":""}]
[{"$f":"IF(ISBLANK('8-Process Controls'!C23),\"\",'8-Process Controls'!C23)","v":""},{"$f":"IF(ISBLANK('8-Process Controls'!D23),\"\",'8-Process Controls'!D23)","v":""},null,{"$f":"IF(ISBLANK('8-Process Controls'!E23),\"\",'8-Process Controls'!E23)","v":""},{"$f":"IF(ISBLANK('8-Process Controls'!F23),\"\",'8-Process Controls'!F23)","v":""},{"$f":"IF(ISBLANK('8-Process Controls'!G23),\"\",IF(LEFT('8-Process Controls'!G23,1)=\"Y\",\"PT\",\"\"))","v":""},null,{"$f":"IF(ISBLANK('8-Process Controls'!S23),\"\",'8-Process Controls'!S23)","v":""},{"$f":"IF(ISBLANK('8-Process Controls'!T23),\"\",'8-Process Controls'!T23)","v":""},null,null,null,null,null,null,null,null,null,null,null,null,null,{"$f":"IF(ISBLANK('8-Process Controls'!U23),\"\",'8-Process Controls'!U23)","v":""}]
[{"$f":"IF(ISBLANK('8-Process Controls'!C24),\"\",'8-Process Controls'!C24)","v":""},{"$f":"IF(ISBLANK('8-Process Controls'!D24),\"\",'8-Process Controls'!D24)","v":""},null,{"$f":"IF(ISBLANK('8-Process Controls'!E24),\"\",'8-Process Controls'!E24)","v":""},{"$f":"IF(ISBLANK('8-Process Controls'!F24),\"\",'8-Process Controls'!F24)","v":""},{"$f":"IF(ISBLANK('8-Process Controls'!G24),\"\",IF(LEFT('8-Process Controls'!G24,1)=\"Y\",\"PT\",\"\"))","v":""},null,{"$f":"IF(ISBLANK('8-Process Controls'!S24),\"\",'8-Process Controls'!S24)","v":""},{"$f":"IF(ISBLANK('8-Process Controls'!T24),\"\",'8-Process Controls'!T24)","v":""},null,null,null,null,null,null,null,null,null,null,null,null,null,{"$f":"IF(ISBLANK('8-Process Controls'!U24),\"\",'8-Process Controls'!U24)","v":""}]
[{"$f":"IF(ISBLANK('8-Process Controls'!C25),\"\",'8-Process Controls'!C25)","v":""},{"$f":"IF(ISBLANK('8-Process Controls'!D25),\"\",'8-Process Controls'!D25)","v":""},null,{"$f":"IF(ISBLANK('8-Process Controls'!E25),\"\",'8-Process Controls'!E25)","v":""},{"$f":"IF(ISBLANK('8-Process Controls'!F25),\"\",'8-Process Controls'!F25)","v":""},{"$f":"IF(ISBLANK('8-Process Controls'!G25),\"\",IF(LEFT('8-Process Controls'!G25,1)=\"Y\",\"PT\",\"\"))","v":""},null,{"$f":"IF(ISBLANK('8-Process Controls'!S25),\"\",'8-Process Controls'!S25)","v":""},{"$f":"IF(ISBLANK('8-Process Controls'!T25),\"\",'8-Process Controls'!T25)","v":""},null,null,null,null,null,null,null,null,null,null,null,null,null,{"$f":"IF(ISBLANK('8-Process Controls'!U25),\"\",'8-Process Controls'!U25)","v":""}]
[{"$f":"IF(ISBLANK('8-Process Controls'!C26),\"\",'8-Process Controls'!C26)","v":""},{"$f":"IF(ISBLANK('8-Process Controls'!D26),\"\",'8-Process Controls'!D26)","v":""},null,{"$f":"IF(ISBLANK('8-Process Controls'!E26),\"\",'8-Process Controls'!E26)","v":""},{"$f":"IF(ISBLANK('8-Process Controls'!F26),\"\",'8-Process Controls'!F26)","v":""},{"$f":"IF(ISBLANK('8-Process Controls'!G26),\"\",IF(LEFT('8-Process Controls'!G26,1)=\"Y\",\"PT\",\"\"))","v":""},null,{"$f":"IF(ISBLANK('8-Process Controls'!S26),\"\",'8-Process Controls'!S26)","v":""},{"$f":"IF(ISBLANK('8-Process Controls'!T26),\"\",'8-Process Controls'!T26)","v":""},null,null,null,null,null,null,null,null,null,null,null,null,null,{"$f":"IF(ISBLANK('8-Process Controls'!U26),\"\",'8-Process Controls'!U26)","v":""}]
[{"$f":"IF(ISBLANK('8-Process Controls'!C27),\"\",'8-Process Controls'!C27)","v":""},{"$f":"IF(ISBLANK('8-Process Controls'!D27),\"\",'8-Process Controls'!D27)","v":""},null,{"$f":"IF(ISBLANK('8-Process Controls'!E27),\"\",'8-Process Controls'!E27)","v":""},{"$f":"IF(ISBLANK('8-Process Controls'!F27),\"\",'8-Process Controls'!F27)","v":""},{"$f":"IF(ISBLANK('8-Process Controls'!G27),\"\",IF(LEFT('8-Process Controls'!G27,1)=\"Y\",\"PT\",\"\"))","v":""},null,{"$f":"IF(ISBLANK('8-Process Controls'!S27),\"\",'8-Process Controls'!S27)","v":""},{"$f":"IF(ISBLANK('8-Process Controls'!T27),\"\",'8-Process Controls'!T27)","v":""},null,null,null,null,null,null,null,null,null,null,null,null,null,{"$f":"IF(ISBLANK('8-Process Controls'!U27),\"\",'8-Process Controls'!U27)","v":""}]
[{"$f":"IF(ISBLANK('8-Process Controls'!C28),\"\",'8-Process Controls'!C28)","v":""},{"$f":"IF(ISBLANK('8-Process Controls'!D28),\"\",'8-Process Controls'!D28)","v":""},null,{"$f":"IF(ISBLANK('8-Process Controls'!E28),\"\",'8-Process Controls'!E28)","v":""},{"$f":"IF(ISBLANK('8-Process Controls'!F28),\"\",'8-Process Controls'!F28)","v":""},{"$f":"IF(ISBLANK('8-Process Controls'!G28),\"\",IF(LEFT('8-Process Controls'!G28,1)=\"Y\",\"PT\",\"\"))","v":""},null,{"$f":"IF(ISBLANK('8-Process Controls'!S28),\"\",'8-Process Controls'!S28)","v":""},{"$f":"IF(ISBLANK('8-Process Controls'!T28),\"\",'8-Process Controls'!T28)","v":""},null,null,null,null,null,null,null,null,null,null,null,null,null,{"$f":"IF(ISBLANK('8-Process Controls'!U28),\"\",'8-Process Controls'!U28)","v":""}]
[{"$f":"IF(ISBLANK('8-Process Controls'!C29),\"\",'8-Process Controls'!C29)","v":""},{"$f":"IF(ISBLANK('8-Process Controls'!D29),\"\",'8-Process Controls'!D29)","v":""},null,{"$f":"IF(ISBLANK('8-Process Controls'!E29),\"\",'8-Process Controls'!E29)","v":""},{"$f":"IF(ISBLANK('8-Process Controls'!F29),\"\",'8-Process Controls'!F29)","v":""},{"$f":"IF(ISBLANK('8-Process Controls'!G29),\"\",IF(LEFT('8-Process Controls'!G29,1)=\"Y\",\"PT\",\"\"))","v":""},null,{"$f":"IF(ISBLANK('8-Process Controls'!S29),\"\",'8-Process Controls'!S29)","v":""},{"$f":"IF(ISBLANK('8-Process Controls'!T29),\"\",'8-Process Controls'!T29)","v":""},null,null,null,null,null,null,null,null,null,null,null,null,null,{"$f":"IF(ISBLANK('8-Process Controls'!U29),\"\",'8-Process Controls'!U29)","v":""}]
[{"$f":"IF(ISBLANK('8-Process Controls'!C30),\"\",'8-Process Controls'!C30)","v":""},{"$f":"IF(ISBLANK('8-Process Controls'!D30),\"\",'8-Process Controls'!D30)","v":""},null,{"$f":"IF(ISBLANK('8-Process Controls'!E30),\"\",'8-Process Controls'!E30)","v":""},{"$f":"IF(ISBLANK('8-Process Controls'!F30),\"\",'8-Process Controls'!F30)","v":""},{"$f":"IF(ISBLANK('8-Process Controls'!G30),\"\",IF(LEFT('8-Process Controls'!G30,1)=\"Y\",\"PT\",\"\"))","v":""},null,{"$f":"IF(ISBLANK('8-Process Controls'!S30),\"\",'8-Process Controls'!S30)","v":""},{"$f":"IF(ISBLANK('8-Process Controls'!T30),\"\",'8-Process Controls'!T30)","v":""},null,null,null,null,null,null,null,null,null,null,null,null,null,{"$f":"IF(ISBLANK('8-Process Controls'!U30),\"\",'8-Process Controls'!U30)","v":""}]
[{"$f":"IF(ISBLANK('8-Process Controls'!C31),\"\",'8-Process Controls'!C31)","v":""},{"$f":"IF(ISBLANK('8-Process Controls'!D31),\"\",'8-Process Controls'!D31)","v":""},null,{"$f":"IF(ISBLANK('8-Process Controls'!E31),\"\",'8-Process Controls'!E31)","v":""},{"$f":"IF(ISBLANK('8-Process Controls'!F31),\"\",'8-Process Controls'!F31)","v":""},{"$f":"IF(ISBLANK('8-Process Controls'!G31),\"\",IF(LEFT('8-Process Controls'!G31,1)=\"Y\",\"PT\",\"\"))","v":""},null,{"$f":"IF(ISBLANK('8-Process Controls'!S31),\"\",'8-Process Controls'!S31)","v":""},{"$f":"IF(ISBLANK('8-Process Controls'!T31),\"\",'8-Process Controls'!T31)","v":""},null,null,null,null,null,null,null,null,null,null,null,null,null,{"$f":"IF(ISBLANK('8-Process Controls'!U31),\"\",'8-Process Controls'!U31)","v":""}]
[{"$f":"IF(ISBLANK('8-Process Controls'!C32),\"\",'8-Process Controls'!C32)","v":""},{"$f":"IF(ISBLANK('8-Process Controls'!D32),\"\",'8-Process Controls'!D32)","v":""},null,{"$f":"IF(ISBLANK('8-Process Controls'!E32),\"\",'8-Process Controls'!E32)","v":""},{"$f":"IF(ISBLANK('8-Process Controls'!F32),\"\",'8-Process Controls'!F32)","v":""},{"$f":"IF(ISBLANK('8-Process Controls'!G32),\"\",IF(LEFT('8-Process Controls'!G32,1)=\"Y\",\"PT\",\"\"))","v":""},null,{"$f":"IF(ISBLANK('8-Process Controls'!S32),\"\",'8-Process Controls'!S32)","v":""},{"$f":"IF(ISBLANK('8-Process Controls'!T32),\"\",'8-Process Controls'!T32)","v":""},null,null,null,null,null,null,null,null,null,null,null,null,null,{"$f":"IF(ISBLANK('8-Process Controls'!U32),\"\",'8-Process Controls'!U32)","v":""}]
[{"$f":"IF(ISBLANK('8-Process Controls'!C33),\"\",'8-Process Controls'!C33)","v":""},{"$f":"IF(ISBLANK('8-Process Controls'!D33),\"\",'8-Process Controls'!D33)","v":""},null,{"$f":"IF(ISBLANK('8-Process Controls'!E33),\"\",'8-Process Controls'!E33)","v":""},{"$f":"IF(ISBLANK('8-Process Controls'!F33),\"\",'8-Process Controls'!F33)","v":""},{"$f":"IF(ISBLANK('8-Process Controls'!G33),\"\",IF(LEFT('8-Process Controls'!G33,1)=\"Y\",\"PT\",\"\"))","v":""},null,{"$f":"IF(ISBLANK('8-Process Controls'!S33),\"\",'8-Process Controls'!S33)","v":""},{"$f":"IF(ISBLANK('8-Process Controls'!T33),\"\",'8-Process Controls'!T33)","v":""},null,null,null,null,null,null,null,null,null,null,null,null,null,{"$f":"IF(ISBLANK('8-Process Controls'!U33),\"\",'8-Process Controls'!U33)","v":""}]
[{"$f":"IF(ISBLANK('8-Process Controls'!C34),\"\",'8-Process Controls'!C34)","v":""},{"$f":"IF(ISBLANK('8-Process Controls'!D34),\"\",'8-Process Controls'!D34)","v":""},null,{"$f":"IF(ISBLANK('8-Process Controls'!E34),\"\",'8-Process Controls'!E34)","v":""},{"$f":"IF(ISBLANK('8-Process Controls'!F34),\"\",'8-Process Controls'!F34)","v":""},{"$f":"IF(ISBLANK('8-Process Controls'!G34),\"\",IF(LEFT('8-Process Controls'!G34,1)=\"Y\",\"PT\",\"\"))","v":""},null,{"$f":"IF(ISBLANK('8-Process Controls'!S34),\"\",'8-Process Controls'!S34)","v":""},{"$f":"IF(ISBLANK('8-Process Controls'!T34),\"\",'8-Process Controls'!T34)","v":""},null,null,null,null,null,null,null,null,null,null,null,null,null,{"$f":"IF(ISBLANK('8-Process Controls'!U34),\"\",'8-Process Controls'!U34)","v":""}]
[{"$f":"IF(ISBLANK('8-Process Controls'!C35),\"\",'8-Process Controls'!C35)","v":""},{"$f":"IF(ISBLANK('8-Process Controls'!D35),\"\",'8-Process Controls'!D35)","v":""},null,{"$f":"IF(ISBLANK('8-Process Controls'!E35),\"\",'8-Process Controls'!E35)","v":""},{"$f":"IF(ISBLANK('8-Process Controls'!F35),\"\",'8-Process Controls'!F35)","v":""},{"$f":"IF(ISBLANK('8-Process Controls'!G35),\"\",IF(LEFT('8-Process Controls'!G35,1)=\"Y\",\"PT\",\"\"))","v":""},null,{"$f":"IF(ISBLANK('8-Process Controls'!S35),\"\",'8-Process Controls'!S35)","v":""},{"$f":"IF(ISBLANK('8-Process Controls'!T35),\"\",'8-Process Controls'!T35)","v":""},null,null,null,null,null,null,null,null,null,null,null,null,null,{"$f":"IF(ISBLANK('8-Process Controls'!U35),\"\",'8-Process Controls'!U35)","v":""}]
[{"$f":"IF(ISBLANK('8-Process Controls'!C36),\"\",'8-Process Controls'!C36)","v":""},{"$f":"IF(ISBLANK('8-Process Controls'!D36),\"\",'8-Process Controls'!D36)","v":""},null,{"$f":"IF(ISBLANK('8-Process Controls'!E36),\"\",'8-Process Controls'!E36)","v":""},{"$f":"IF(ISBLANK('8-Process Controls'!F36),\"\",'8-Process Controls'!F36)","v":""},{"$f":"IF(ISBLANK('8-Process Controls'!G36),\"\",IF(LEFT('8-Process Controls'!G36,1)=\"Y\",\"PT\",\"\"))","v":""},null,{"$f":"IF(ISBLANK('8-Process Controls'!S36),\"\",'8-Process Controls'!S36)","v":""},{"$f":"IF(ISBLANK('8-Process Controls'!T36),\"\",'8-Process Controls'!T36)","v":""},null,null,null,null,null,null,null,null,null,null,null,null,null,{"$f":"IF(ISBLANK('8-Process Controls'!U36),\"\",'8-Process Controls'!U36)","v":""}]
[{"$f":"IF(ISBLANK('8-Process Controls'!C37),\"\",'8-Process Controls'!C37)","v":""},{"$f":"IF(ISBLANK('8-Process Controls'!D37),\"\",'8-Process Controls'!D37)","v":""},null,{"$f":"IF(ISBLANK('8-Process Controls'!E37),\"\",'8-Process Controls'!E37)","v":""},{"$f":"IF(ISBLANK('8-Process Controls'!F37),\"\",'8-Process Controls'!F37)","v":""},{"$f":"IF(ISBLANK('8-Process Controls'!G37),\"\",IF(LEFT('8-Process Controls'!G37,1)=\"Y\",\"PT\",\"\"))","v":""},null,{"$f":"IF(ISBLANK('8-Process Controls'!S37),\"\",'8-Process Controls'!S37)","v":""},{"$f":"IF(ISBLANK('8-Process Controls'!T37),\"\",'8-Process Controls'!T37)","v":""},null,null,null,null,null,null,null,null,null,null,null,null,null,{"$f":"IF(ISBLANK('8-Process Controls'!U37),\"\",'8-Process Controls'!U37)","v":""}]
[{"$f":"IF(ISBLANK('8-Process Controls'!C38),\"\",'8-Process Controls'!C38)","v":""},{"$f":"IF(ISBLANK('8-Process Controls'!D38),\"\",'8-Process Controls'!D38)","v":""},null,{"$f":"IF(ISBLANK('8-Process Controls'!E38),\"\",'8-Process Controls'!E38)","v":""},{"$f":"IF(ISBLANK('8-Process Controls'!F38),\"\",'8-Process Controls'!F38)","v":""},{"$f":"IF(ISBLANK('8-Process Controls'!G38),\"\",IF(LEFT('8-Process Controls'!G38,1)=\"Y\",\"PT\",\"\"))","v":""},null,{"$f":"IF(ISBLANK('8-Process Controls'!S38),\"\",'8-Process Controls'!S38)","v":""},{"$f":"IF(ISBLANK('8-Process Controls'!T38),\"\",'8-Process Controls'!T38)","v":""},null,null,null,null,null,null,null,null,null,null,null,null,null,{"$f":"IF(ISBLANK('8-Process Controls'!U38),\"\",'8-Process Controls'!U38)","v":""}]
[{"$f":"IF(ISBLANK('8-Process Controls'!C39),\"\",'8-Process Controls'!C39)","v":""},{"$f":"IF(ISBLANK('8-Process Controls'!D39),\"\",'8-Process Controls'!D39)","v":""},null,{"$f":"IF(ISBLANK('8-Process Controls'!E39),\"\",'8-Process Controls'!E39)","v":""},{"$f":"IF(ISBLANK('8-Process Controls'!F39),\"\",'8-Process Controls'!F39)","v":""},{"$f":"IF(ISBLANK('8-Process Controls'!G39),\"\",IF(LEFT('8-Process Controls'!G39,1)=\"Y\",\"PT\",\"\"))","v":""},null,{"$f":"IF(ISBLANK('8-Process Controls'!S39),\"\",'8-Process Controls'!S39)","v":""},{"$f":"IF(ISBLANK('8-Process Controls'!T39),\"\",'8-Process Controls'!T39)","v":""},null,null,null,null,null,null,null,null,null,null,null,null,null,{"$f":"IF(ISBLANK('8-Process Controls'!U39),\"\",'8-Process Controls'!U39)","v":""}]
[{"$f":"IF(ISBLANK('8-Process Controls'!C40),\"\",'8-Process Controls'!C40)","v":""},{"$f":"IF(ISBLANK('8-Process Controls'!D40),\"\",'8-Process Controls'!D40)","v":""},null,{"$f":"IF(ISBLANK('8-Process Controls'!E40),\"\",'8-Process Controls'!E40)","v":""},{"$f":"IF(ISBLANK('8-Process Controls'!F40),\"\",'8-Process Controls'!F40)","v":""},{"$f":"IF(ISBLANK('8-Process Controls'!G40),\"\",IF(LEFT('8-Process Controls'!G40,1)=\"Y\",\"PT\",\"\"))","v":""},null,{"$f":"IF(ISBLANK('8-Process Controls'!S40),\"\",'8-Process Controls'!S40)","v":""},{"$f":"IF(ISBLANK('8-Process Controls'!T40),\"\",'8-Process Controls'!T40)","v":""},null,null,null,null,null,null,null,null,null,null,null,null,null,{"$f":"IF(ISBLANK('8-Process Controls'!U40),\"\",'8-Process Controls'!U40)","v":""}]
[{"$f":"IF(ISBLANK('8-Process Controls'!C41),\"\",'8-Process Controls'!C41)","v":""},{"$f":"IF(ISBLANK('8-Process Controls'!D41),\"\",'8-Process Controls'!D41)","v":""},null,{"$f":"IF(ISBLANK('8-Process Controls'!E41),\"\",'8-Process Controls'!E41)","v":""},{"$f":"IF(ISBLANK('8-Process Controls'!F41),\"\",'8-Process Controls'!F41)","v":""},{"$f":"IF(ISBLANK('8-Process Controls'!G41),\"\",IF(LEFT('8-Process Controls'!G41,1)=\"Y\",\"PT\",\"\"))","v":""},null,{"$f":"IF(ISBLANK('8-Process Controls'!S41),\"\",'8-Process Controls'!S41)","v":""},{"$f":"IF(ISBLANK('8-Process Controls'!T41),\"\",'8-Process Controls'!T41)","v":""},null,null,null,null,null,null,null,null,null,null,null,null,null,{"$f":"IF(ISBLANK('8-Process Controls'!U41),\"\",'8-Process Controls'!U41)","v":""}]
[{"$f":"IF(ISBLANK('8-Process Controls'!C42),\"\",'8-Process Controls'!C42)","v":""},{"$f":"IF(ISBLANK('8-Process Controls'!D42),\"\",'8-Process Controls'!D42)","v":""},null,{"$f":"IF(ISBLANK('8-Process Controls'!E42),\"\",'8-Process Controls'!E42)","v":""},{"$f":"IF(ISBLANK('8-Process Controls'!F42),\"\",'8-Process Controls'!F42)","v":""},{"$f":"IF(ISBLANK('8-Process Controls'!G42),\"\",IF(LEFT('8-Process Controls'!G42,1)=\"Y\",\"PT\",\"\"))","v":""},null,{"$f":"IF(ISBLANK('8-Process Controls'!S42),\"\",'8-Process Controls'!S42)","v":""},{"$f":"IF(ISBLANK('8-Process Controls'!T42),\"\",'8-Process Controls'!T42)","v":""},null,null,null,null,null,null,null,null,null,null,null,null,null,{"$f":"IF(ISBLANK('8-Process Controls'!U42),\"\",'8-Process Controls'!U42)","v":""}]
[{"$f":"IF(ISBLANK('8-Process Controls'!C43),\"\",'8-Process Controls'!C43)","v":""},{"$f":"IF(ISBLANK('8-Process Controls'!D43),\"\",'8-Process Controls'!D43)","v":""},null,{"$f":"IF(ISBLANK('8-Process Controls'!E43),\"\",'8-Process Controls'!E43)","v":""},{"$f":"IF(ISBLANK('8-Process Controls'!F43),\"\",'8-Process Controls'!F43)","v":""},{"$f":"IF(ISBLANK('8-Process Controls'!G43),\"\",IF(LEFT('8-Process Controls'!G43,1)=\"Y\",\"PT\",\"\"))","v":""},null,{"$f":"IF(ISBLANK('8-Process Controls'!S43),\"\",'8-Process Controls'!S43)","v":""},{"$f":"IF(ISBLANK('8-Process Controls'!T43),\"\",'8-Process Controls'!T43)","v":""},null,null,null,null,null,null,null,null,null,null,null,null,null,{"$f":"IF(ISBLANK('8-Process Controls'!U43),\"\",'8-Process Controls'!U43)","v":""}]
[{"$f":"IF(ISBLANK('8-Process Controls'!C44),\"\",'8-Process Controls'!C44)","v":""},{"$f":"IF(ISBLANK('8-Process Controls'!D44),\"\",'8-Process Controls'!D44)","v":""},null,{"$f":"IF(ISBLANK('8-Process Controls'!E44),\"\",'8-Process Controls'!E44)","v":""},{"$f":"IF(ISBLANK('8-Process Controls'!F44),\"\",'8-Process Controls'!F44)","v":""},{"$f":"IF(ISBLANK('8-Process Controls'!G44),\"\",IF(LEFT('8-Process Controls'!G44,1)=\"Y\",\"PT\",\"\"))","v":""},null,{"$f":"IF(ISBLANK('8-Process Controls'!S44),\"\",'8-Process Controls'!S44)","v":""},{"$f":"IF(ISBLANK('8-Process Controls'!T44),\"\",'8-Process Controls'!T44)","v":""},null,null,null,null,null,null,null,null,null,null,null,null,null,{"$f":"IF(ISBLANK('8-Process Controls'!U44),\"\",'8-Process Controls'!U44)","v":""}]
[{"$f":"IF(ISBLANK('8-Process Controls'!C45),\"\",'8-Process Controls'!C45)","v":""},{"$f":"IF(ISBLANK('8-Process Controls'!D45),\"\",'8-Process Controls'!D45)","v":""},null,{"$f":"IF(ISBLANK('8-Process Controls'!E45),\"\",'8-Process Controls'!E45)","v":""},{"$f":"IF(ISBLANK('8-Process Controls'!F45),\"\",'8-Process Controls'!F45)","v":""},{"$f":"IF(ISBLANK('8-Process Controls'!G45),\"\",IF(LEFT('8-Process Controls'!G45,1)=\"Y\",\"PT\",\"\"))","v":""},null,{"$f":"IF(ISBLANK('8-Process Controls'!S45),\"\",'8-Process Controls'!S45)","v":""},{"$f":"IF(ISBLANK('8-Process Controls'!T45),\"\",'8-Process Controls'!T45)","v":""},null,null,null,null,null,null,null,null,null,null,null,null,null,{"$f":"IF(ISBLANK('8-Process Controls'!U45),\"\",'8-Process Controls'!U45)","v":""}]
[{"$f":"IF(ISBLANK('8-Process Controls'!C46),\"\",'8-Process Controls'!C46)","v":""},{"$f":"IF(ISBLANK('8-Process Controls'!D46),\"\",'8-Process Controls'!D46)","v":""},null,{"$f":"IF(ISBLANK('8-Process Controls'!E46),\"\",'8-Process Controls'!E46)","v":""},{"$f":"IF(ISBLANK('8-Process Controls'!F46),\"\",'8-Process Controls'!F46)","v":""},{"$f":"IF(ISBLANK('8-Process Controls'!G46),\"\",IF(LEFT('8-Process Controls'!G46,1)=\"Y\",\"PT\",\"\"))","v":""},null,{"$f":"IF(ISBLANK('8-Process Controls'!S46),\"\",'8-Process Controls'!S46)","v":""},{"$f":"IF(ISBLANK('8-Process Controls'!T46),\"\",'8-Process Controls'!T46)","v":""},null,null,null,null,null,null,null,null,null,null,null,null,null,{"$f":"IF(ISBLANK('8-Process Controls'!U46),\"\",'8-Process Controls'!U46)","v":""}]
[{"$f":"IF(ISBLANK('8-Process Controls'!C47),\"\",'8-Process Controls'!C47)","v":""},{"$f":"IF(ISBLANK('8-Process Controls'!D47),\"\",'8-Process Controls'!D47)","v":""},null,{"$f":"IF(ISBLANK('8-Process Controls'!E47),\"\",'8-Process Controls'!E47)","v":""},{"$f":"IF(ISBLANK('8-Process Controls'!F47),\"\",'8-Process Controls'!F47)","v":""},{"$f":"IF(ISBLANK('8-Process Controls'!G47),\"\",IF(LEFT('8-Process Controls'!G47,1)=\"Y\",\"PT\",\"\"))","v":""},null,{"$f":"IF(ISBLANK('8-Process Controls'!S47),\"\",'8-Process Controls'!S47)","v":""},{"$f":"IF(ISBLANK('8-Process Controls'!T47),\"\",'8-Process Controls'!T47)","v":""},null,null,null,null,null,null,null,null,null,null,null,null,null,{"$f":"IF(ISBLANK('8-Process Controls'!U47),\"\",'8-Process Controls'!U47)","v":""}]
[{"$f":"IF(ISBLANK('8-Process Controls'!C48),\"\",'8-Process Controls'!C48)","v":""},{"$f":"IF(ISBLANK('8-Process Controls'!D48),\"\",'8-Process Controls'!D48)","v":""},null,{"$f":"IF(ISBLANK('8-Process Controls'!E48),\"\",'8-Process Controls'!E48)","v":""},{"$f":"IF(ISBLANK('8-Process Controls'!F48),\"\",'8-Process Controls'!F48)","v":""},{"$f":"IF(ISBLANK('8-Process Controls'!G48),\"\",IF(LEFT('8-Process Controls'!G48,1)=\"Y\",\"PT\",\"\"))","v":""},null,{"$f":"IF(ISBLANK('8-Process Controls'!S48),\"\",'8-Process Controls'!S48)","v":""},{"$f":"IF(ISBLANK('8-Process Controls'!T48),\"\",'8-Process Controls'!T48)","v":""},null,null,null,null,null,null,null,null,null,null,null,null,null,{"$f":"IF(ISBLANK('8-Process Controls'!U48),\"\",'8-Process Controls'!U48)","v":""}]
[{"$f":"IF(ISBLANK('8-Process Controls'!C49),\"\",'8-Process Controls'!C49)","v":""},{"$f":"IF(ISBLANK('8-Process Controls'!D49),\"\",'8-Process Controls'!D49)","v":""},null,{"$f":"IF(ISBLANK('8-Process Controls'!E49),\"\",'8-Process Controls'!E49)","v":""},{"$f":"IF(ISBLANK('8-Process Controls'!F49),\"\",'8-Process Controls'!F49)","v":""},{"$f":"IF(ISBLANK('8-Process Controls'!G49),\"\",IF(LEFT('8-Process Controls'!G49,1)=\"Y\",\"PT\",\"\"))","v":""},null,{"$f":"IF(ISBLANK('8-Process Controls'!S49),\"\",'8-Process Controls'!S49)","v":""},{"$f":"IF(ISBLANK('8-Process Controls'!T49),\"\",'8-Process Controls'!T49)","v":""},null,null,null,null,null,null,null,null,null,null,null,null,null,{"$f":"IF(ISBLANK('8-Process Controls'!U49),\"\",'8-Process Controls'!U49)","v":""}]
[{"$f":"IF(ISBLANK('8-Process Controls'!C50),\"\",'8-Process Controls'!C50)","v":""},{"$f":"IF(ISBLANK('8-Process Controls'!D50),\"\",'8-Process Controls'!D50)","v":""},null,{"$f":"IF(ISBLANK('8-Process Controls'!E50),\"\",'8-Process Controls'!E50)","v":""},{"$f":"IF(ISBLANK('8-Process Controls'!F50),\"\",'8-Process Controls'!F50)","v":""},{"$f":"IF(ISBLANK('8-Process Controls'!G50),\"\",IF(LEFT('8-Process Controls'!G50,1)=\"Y\",\"PT\",\"\"))","v":""},null,{"$f":"IF(ISBLANK('8-Process Controls'!S50),\"\",'8-Process Controls'!S50)","v":""},{"$f":"IF(ISBLANK('8-Process Controls'!T50),\"\",'8-Process Controls'!T50)","v":""},null,null,null,null,null,null,null,null,null,null,null,null,null,{"$f":"IF(ISBLANK('8-Process Controls'!U50),\"\",'8-Process Controls'!U50)","v":""}]
[{"$f":"IF(ISBLANK('8-Process Controls'!C51),\"\",'8-Process Controls'!C51)","v":""},{"$f":"IF(ISBLANK('8-Process Controls'!D51),\"\",'8-Process Controls'!D51)","v":""},null,{"$f":"IF(ISBLANK('8-Process Controls'!E51),\"\",'8-Process Controls'!E51)","v":""},{"$f":"IF(ISBLANK('8-Process Controls'!F51),\"\",'8-Process Controls'!F51)","v":""},{"$f":"IF(ISBLANK('8-Process Controls'!G51),\"\",IF(LEFT('8-Process Controls'!G51,1)=\"Y\",\"PT\",\"\"))","v":""},null,{"$f":"IF(ISBLANK('8-Process Controls'!S51),\"\",'8-Process Controls'!S51)","v":""},{"$f":"IF(ISBLANK('8-Process Controls'!T51),\"\",'8-Process Controls'!T51)","v":""},null,null,null,null,null,null,null,null,null,null,null,null,null,{"$f":"IF(ISBLANK('8-Process Controls'!U51),\"\",'8-Process Controls'!U51)","v":""}]
[{"$f":"IF(ISBLANK('8-Process Controls'!C52),\"\",'8-Process Controls'!C52)","v":""},{"$f":"IF(ISBLANK('8-Process Controls'!D52),\"\",'8-Process Controls'!D52)","v":""},null,{"$f":"IF(ISBLANK('8-Process Controls'!E52),\"\",'8-Process Controls'!E52)","v":""},{"$f":"IF(ISBLANK('8-Process Controls'!F52),\"\",'8-Process Controls'!F52)","v":""},{"$f":"IF(ISBLANK('8-Process Controls'!G52),\"\",IF(LEFT('8-Process Controls'!G52,1)=\"Y\",\"PT\",\"\"))","v":""},null,{"$f":"IF(ISBLANK('8-Process Controls'!S52),\"\",'8-Process Controls'!S52)","v":""},{"$f":"IF(ISBLANK('8-Process Controls'!T52),\"\",'8-Process Controls'!T52)","v":""},null,null,null,null,null,null,null,null,null,null,null,null,null,{"$f":"IF(ISBLANK('8-Process Controls'!U52),\"\",'8-Process Controls'!U52)","v":""}]
[{"$f":"IF(ISBLANK('8-Process Controls'!C53),\"\",'8-Process Controls'!C53)","v":""},{"$f":"IF(ISBLANK('8-Process Controls'!D53),\"\",'8-Process Controls'!D53)","v":""},null,{"$f":"IF(ISBLANK('8-Process Controls'!E53),\"\",'8-Process Controls'!E53)","v":""},{"$f":"IF(ISBLANK('8-Process Controls'!F53),\"\",'8-Process Controls'!F53)","v":""},{"$f":"IF(ISBLANK('8-Process Controls'!G53),\"\",IF(LEFT('8-Process Controls'!G53,1)=\"Y\",\"PT\",\"\"))","v":""},null,{"$f":"IF(ISBLANK('8-Process Controls'!S53),\"\",'8-Process Controls'!S53)","v":""},{"$f":"IF(ISBLANK('8-Process Controls'!T53),\"\",'8-Process Controls'!T53)","v":""},null,null,null,null,null,null,null,null,null,null,null,null,null,{"$f":"IF(ISBLANK('8-Process Controls'!U53),\"\",'8-Process Controls'!U53)","v":""}]
[{"$f":"IF(ISBLANK('8-Process Controls'!C54),\"\",'8-Process Controls'!C54)","v":""},{"$f":"IF(ISBLANK('8-Process Controls'!D54),\"\",'8-Process Controls'!D54)","v":""},null,{"$f":"IF(ISBLANK('8-Process Controls'!E54),\"\",'8-Process Controls'!E54)","v":""},{"$f":"IF(ISBLANK('8-Process Controls'!F54),\"\",'8-Process Controls'!F54)","v":""},{"$f":"IF(ISBLANK('8-Process Controls'!G54),\"\",IF(LEFT('8-Process Controls'!G54,1)=\"Y\",\"PT\",\"\"))","v":""},null,{"$f":"IF(ISBLANK('8-Process Controls'!S54),\"\",'8-Process Controls'!S54)","v":""},{"$f":"IF(ISBLANK('8-Process Controls'!T54),\"\",'8-Process Controls'!T54)","v":""},null,null,null,null,null,null,null,null,null,null,null,null,null,{"$f":"IF(ISBLANK('8-Process Controls'!U54),\"\",'8-Process Controls'!U54)","v":""}]
[{"$f":"IF(ISBLANK('8-Process Controls'!C55),\"\",'8-Process Controls'!C55)","v":""},{"$f":"IF(ISBLANK('8-Process Controls'!D55),\"\",'8-Process Controls'!D55)","v":""},null,{"$f":"IF(ISBLANK('8-Process Controls'!E55),\"\",'8-Process Controls'!E55)","v":""},{"$f":"IF(ISBLANK('8-Process Controls'!F55),\"\",'8-Process Controls'!F55)","v":""},{"$f":"IF(ISBLANK('8-Process Controls'!G55),\"\",IF(LEFT('8-Process Controls'!G55,1)=\"Y\",\"PT\",\"\"))","v":""},null,{"$f":"IF(ISBLANK('8-Process Controls'!S55),\"\",'8-Process Controls'!S55)","v":""},{"$f":"IF(ISBLANK('8-Process Controls'!T55),\"\",'8-Process Controls'!T55)","v":""},null,null,null,null,null,null,null,null,null,null,null,null,null,{"$f":"IF(ISBLANK('8-Process Controls'!U55),\"\",'8-Process Controls'!U55)","v":""}]
[{"$f":"IF(ISBLANK('8-Process Controls'!C56),\"\",'8-Process Controls'!C56)","v":""},{"$f":"IF(ISBLANK('8-Process Controls'!D56),\"\",'8-Process Controls'!D56)","v":""},null,{"$f":"IF(ISBLANK('8-Process Controls'!E56),\"\",'8-Process Controls'!E56)","v":""},{"$f":"IF(ISBLANK('8-Process Controls'!F56),\"\",'8-Process Controls'!F56)","v":""},{"$f":"IF(ISBLANK('8-Process Controls'!G56),\"\",IF(LEFT('8-Process Controls'!G56,1)=\"Y\",\"PT\",\"\"))","v":""},null,{"$f":"IF(ISBLANK('8-Process Controls'!S56),\"\",'8-Process Controls'!S56)","v":""},{"$f":"IF(ISBLANK('8-Process Controls'!T56),\"\",'8-Process Controls'!T56)","v":""},null,null,null,null,null,null,null,null,null,null,null,null,null,{"$f":"IF(ISBLANK('8-Process Controls'!U56),\"\",'8-Process Controls'!U56)","v":""}]
[{"$f":"IF(ISBLANK('8-Process Controls'!C57),\"\",'8-Process Controls'!C57)","v":""},{"$f":"IF(ISBLANK('8-Process Controls'!D57),\"\",'8-Process Controls'!D57)","v":""},null,{"$f":"IF(ISBLANK('8-Process Controls'!E57),\"\",'8-Process Controls'!E57)","v":""},{"$f":"IF(ISBLANK('8-Process Controls'!F57),\"\",'8-Process Controls'!F57)","v":""},{"$f":"IF(ISBLANK('8-Process Controls'!G57),\"\",IF(LEFT('8-Process Controls'!G57,1)=\"Y\",\"PT\",\"\"))","v":""},null,{"$f":"IF(ISBLANK('8-Process Controls'!S57),\"\",'8-Process Controls'!S57)","v":""},{"$f":"IF(ISBLANK('8-Process Controls'!T57),\"\",'8-Process Controls'!T57)","v":""},null,null,null,null,null,null,null,null,null,null,null,null,null,{"$f":"IF(ISBLANK('8-Process Controls'!U57),\"\",'8-Process Controls'!U57)","v":""}]
[{"$f":"IF(ISBLANK('8-Process Controls'!C58),\"\",'8-Process Controls'!C58)","v":""},{"$f":"IF(ISBLANK('8-Process Controls'!D58),\"\",'8-Process Controls'!D58)","v":""},null,{"$f":"IF(ISBLANK('8-Process Controls'!E58),\"\",'8-Process Controls'!E58)","v":""},{"$f":"IF(ISBLANK('8-Process Controls'!F58),\"\",'8-Process Controls'!F58)","v":""},{"$f":"IF(ISBLANK('8-Process Controls'!G58),\"\",IF(LEFT('8-Process Controls'!G58,1)=\"Y\",\"PT\",\"\"))","v":""},null,{"$f":"IF(ISBLANK('8-Process Controls'!S58),\"\",'8-Process Controls'!S58)","v":""},{"$f":"IF(ISBLANK('8-Process Controls'!T58),\"\",'8-Process Controls'!T58)","v":""},null,null,null,null,null,null,null,null,null,null,null,null,null,{"$f":"IF(ISBLANK('8-Process Controls'!U58),\"\",'8-Process Controls'!U58)","v":""}]
[{"$f":"IF(ISBLANK('8-Process Controls'!C59),\"\",'8-Process Controls'!C59)","v":""},{"$f":"IF(ISBLANK('8-Process Controls'!D59),\"\",'8-Process Controls'!D59)","v":""},null,{"$f":"IF(ISBLANK('8-Process Controls'!E59),\"\",'8-Process Controls'!E59)","v":""},{"$f":"IF(ISBLANK('8-Process Controls'!F59),\"\",'8-Process Controls'!F59)","v":""},{"$f":"IF(ISBLANK('8-Process Controls'!G59),\"\",IF(LEFT('8-Process Controls'!G59,1)=\"Y\",\"PT\",\"\"))","v":""},null,{"$f":"IF(ISBLANK('8-Process Controls'!S59),\"\",'8-Process Controls'!S59)","v":""},{"$f":"IF(ISBLANK('8-Process Controls'!T59),\"\",'8-Process Controls'!T59)","v":""},null,null,null,null,null,null,null,null,null,null,null,null,null,{"$f":"IF(ISBLANK('8-Process Controls'!U59),\"\",'8-Process Controls'!U59)","v":""}]
[{"$f":"IF(ISBLANK('8-Process Controls'!C60),\"\",'8-Process Controls'!C60)","v":""},{"$f":"IF(ISBLANK('8-Process Controls'!D60),\"\",'8-Process Controls'!D60)","v":""},null,{"$f":"IF(ISBLANK('8-Process Controls'!E60),\"\",'8-Process Controls'!E60)","v":""},{"$f":"IF(ISBLANK('8-Process Controls'!F60),\"\",'8-Process Controls'!F60)","v":""},{"$f":"IF(ISBLANK('8-Process Controls'!G60),\"\",IF(LEFT('8-Process Controls'!G60,1)=\"Y\",\"PT\",\"\"))","v":""},null,{"$f":"IF(ISBLANK('8-Process Controls'!S60),\"\",'8-Process Controls'!S60)","v":""},{"$f":"IF(ISBLANK('8-Process Controls'!T60),\"\",'8-Process Controls'!T60)","v":""},null,null,null,null,null,null,null,null,null,null,null,null,null,{"$f":"IF(ISBLANK('8-Process Controls'!U60),\"\",'8-Process Controls'!U60)","v":""}]
[{"$f":"IF(ISBLANK('8-Process Controls'!C61),\"\",'8-Process Controls'!C61)","v":""},{"$f":"IF(ISBLANK('8-Process Controls'!D61),\"\",'8-Process Controls'!D61)","v":""},null,{"$f":"IF(ISBLANK('8-Process Controls'!E61),\"\",'8-Process Controls'!E61)","v":""},{"$f":"IF(ISBLANK('8-Process Controls'!F61),\"\",'8-Process Controls'!F61)","v":""},{"$f":"IF(ISBLANK('8-Process Controls'!G61),\"\",IF(LEFT('8-Process Controls'!G61,1)=\"Y\",\"PT\",\"\"))","v":""},null,{"$f":"IF(ISBLANK('8-Process Controls'!S61),\"\",'8-Process Controls'!S61)","v":""},{"$f":"IF(ISBLANK('8-Process Controls'!T61),\"\",'8-Process Controls'!T61)","v":""},null,null,null,null,null,null,null,null,null,null,null,null,null,{"$f":"IF(ISBLANK('8-Process Controls'!U61),\"\",'8-Process Controls'!U61)","v":""}]
[{"$f":"IF(ISBLANK('8-Process Controls'!C62),\"\",'8-Process Controls'!C62)","v":""},{"$f":"IF(ISBLANK('8-Process Controls'!D62),\"\",'8-Process Controls'!D62)","v":""},null,{"$f":"IF(ISBLANK('8-Process Controls'!E62),\"\",'8-Process Controls'!E62)","v":""},{"$f":"IF(ISBLANK('8-Process Controls'!F62),\"\",'8-Process Controls'!F62)","v":""},{"$f":"IF(ISBLANK('8-Process Controls'!G62),\"\",IF(LEFT('8-Process Controls'!G62,1)=\"Y\",\"PT\",\"\"))","v":""},null,{"$f":"IF(ISBLANK('8-Process Controls'!S62),\"\",'8-Process Controls'!S62)","v":""},{"$f":"IF(ISBLANK('8-Process Controls'!T62),\"\",'8-Process Controls'!T62)","v":""},null,null,null,null,null,null,null,null,null,null,null,null,null,{"$f":"IF(ISBLANK('8-Process Controls'!U62),\"\",'8-Process Controls'!U62)","v":""}]
[{"$f":"IF(ISBLANK('8-Process Controls'!C63),\"\",'8-Process Controls'!C63)","v":""},{"$f":"IF(ISBLANK('8-Process Controls'!D63),\"\",'8-Process Controls'!D63)","v":""},null,{"$f":"IF(ISBLANK('8-Process Controls'!E63),\"\",'8-Process Controls'!E63)","v":""},{"$f":"IF(ISBLANK('8-Process Controls'!F63),\"\",'8-Process Controls'!F63)","v":""},{"$f":"IF(ISBLANK('8-Process Controls'!G63),\"\",IF(LEFT('8-Process Controls'!G63,1)=\"Y\",\"PT\",\"\"))","v":""},null,{"$f":"IF(ISBLANK('8-Process Controls'!S63),\"\",'8-Process Controls'!S63)","v":""},{"$f":"IF(ISBLANK('8-Process Controls'!T63),\"\",'8-Process Controls'!T63)","v":""},null,null,null,null,null,null,null,null,null,null,null,null,null,{"$f":"IF(ISBLANK('8-Process Controls'!U63),\"\",'8-Process Controls'!U63)","v":""}]
[{"$f":"IF(ISBLANK('8-Process Controls'!C64),\"\",'8-Process Controls'!C64)","v":""},{"$f":"IF(ISBLANK('8-Process Controls'!D64),\"\",'8-Process Controls'!D64)","v":""},null,{"$f":"IF(ISBLANK('8-Process Controls'!E64),\"\",'8-Process Controls'!E64)","v":""},{"$f":"IF(ISBLANK('8-Process Controls'!F64),\"\",'8-Process Controls'!F64)","v":""},{"$f":"IF(ISBLANK('8-Process Controls'!G64),\"\",IF(LEFT('8-Process Controls'!G64,1)=\"Y\",\"PT\",\"\"))","v":""},null,{"$f":"IF(ISBLANK('8-Process Controls'!S64),\"\",'8-Process Controls'!S64)","v":""},{"$f":"IF(ISBLANK('8-Process Controls'!T64),\"\",'8-Process Controls'!T64)","v":""},null,null,null,null,null,null,null,null,null,null,null,null,null,{"$f":"IF(ISBLANK('8-Process Controls'!U64),\"\",'8-Process Controls'!U64)","v":""}]
[{"$f":"IF(ISBLANK('8-Process Controls'!C65),\"\",'8-Process Controls'!C65)","v":""},{"$f":"IF(ISBLANK('8-Process Controls'!D65),\"\",'8-Process Controls'!D65)","v":""},null,{"$f":"IF(ISBLANK('8-Process Controls'!E65),\"\",'8-Process Controls'!E65)","v":""},{"$f":"IF(ISBLANK('8-Process Controls'!F65),\"\",'8-Process Controls'!F65)","v":""},{"$f":"IF(ISBLANK('8-Process Controls'!G65),\"\",IF(LEFT('8-Process Controls'!G65,1)=\"Y\",\"PT\",\"\"))","v":""},null,{"$f":"IF(ISBLANK('8-Process Controls'!S65),\"\",'8-Process Controls'!S65)","v":""},{"$f":"IF(ISBLANK('8-Process Controls'!T65),\"\",'8-Process Controls'!T65)","v":""},null,null,null,null,null,null,null,null,null,null,null,null,null,{"$f":"IF(ISBLANK('8-Process Controls'!U65),\"\",'8-Process Controls'!U65)","v":""}]
[{"$f":"IF(ISBLANK('8-Process Controls'!C66),\"\",'8-Process Controls'!C66)","v":""},{"$f":"IF(ISBLANK('8-Process Controls'!D66),\"\",'8-Process Controls'!D66)","v":""},null,{"$f":"IF(ISBLANK('8-Process Controls'!E66),\"\",'8-Process Controls'!E66)","v":""},{"$f":"IF(ISBLANK('8-Process Controls'!F66),\"\",'8-Process Controls'!F66)","v":""},{"$f":"IF(ISBLANK('8-Process Controls'!G66),\"\",IF(LEFT('8-Process Controls'!G66,1)=\"Y\",\"PT\",\"\"))","v":""},null,{"$f":"IF(ISBLANK('8-Process Controls'!S66),\"\",'8-Process Controls'!S66)","v":""},{"$f":"IF(ISBLANK('8-Process Controls'!T66),\"\",'8-Process Controls'!T66)","v":""},null,null,null,null,null,null,null,null,null,null,null,null,null,{"$f":"IF(ISBLANK('8-Process Controls'!U66),\"\",'8-Process Controls'!U66)","v":""}]
[{"$f":"IF(ISBLANK('8-Process Controls'!C67),\"\",'8-Process Controls'!C67)","v":""},{"$f":"IF(ISBLANK('8-Process Controls'!D67),\"\",'8-Process Controls'!D67)","v":""},null,{"$f":"IF(ISBLANK('8-Process Controls'!E67),\"\",'8-Process Controls'!E67)","v":""},{"$f":"IF(ISBLANK('8-Process Controls'!F67),\"\",'8-Process Controls'!F67)","v":""},{"$f":"IF(ISBLANK('8-Process Controls'!G67),\"\",IF(LEFT('8-Process Controls'!G67,1)=\"Y\",\"PT\",\"\"))","v":""},null,{"$f":"IF(ISBLANK('8-Process Controls'!S67),\"\",'8-Process Controls'!S67)","v":""},{"$f":"IF(ISBLANK('8-Process Controls'!T67),\"\",'8-Process Controls'!T67)","v":""},null,null,null,null,null,null,null,null,null,null,null,null,null,{"$f":"IF(ISBLANK('8-Process Controls'!U67),\"\",'8-Process Controls'!U67)","v":""}]
[{"$f":"IF(ISBLANK('8-Process Controls'!C68),\"\",'8-Process Controls'!C68)","v":""},{"$f":"IF(ISBLANK('8-Process Controls'!D68),\"\",'8-Process Controls'!D68)","v":""},null,{"$f":"IF(ISBLANK('8-Process Controls'!E68),\"\",'8-Process Controls'!E68)","v":""},{"$f":"IF(ISBLANK('8-Process Controls'!F68),\"\",'8-Process Controls'!F68)","v":""},{"$f":"IF(ISBLANK('8-Process Controls'!G68),\"\",IF(LEFT('8-Process Controls'!G68,1)=\"Y\",\"PT\",\"\"))","v":""},null,{"$f":"IF(ISBLANK('8-Process Controls'!S68),\"\",'8-Process Controls'!S68)","v":""},{"$f":"IF(ISBLANK('8-Process Controls'!T68),\"\",'8-Process Controls'!T68)","v":""},null,null,null,null,null,null,null,null,null,null,null,null,null,{"$f":"IF(ISBLANK('8-Process Controls'!U68),\"\",'8-Process Controls'!U68)","v":""}]
[{"$f":"IF(ISBLANK('8-Process Controls'!C69),\"\",'8-Process Controls'!C69)","v":""},{"$f":"IF(ISBLANK('8-Process Controls'!D69),\"\",'8-Process Controls'!D69)","v":""},null,{"$f":"IF(ISBLANK('8-Process Controls'!E69),\"\",'8-Process Controls'!E69)","v":""},{"$f":"IF(ISBLANK('8-Process Controls'!F69),\"\",'8-Process Controls'!F69)","v":""},{"$f":"IF(ISBLANK('8-Process Controls'!G69),\"\",IF(LEFT('8-Process Controls'!G69,1)=\"Y\",\"PT\",\"\"))","v":""},null,{"$f":"IF(ISBLANK('8-Process Controls'!S69),\"\",'8-Process Controls'!S69)","v":""},{"$f":"IF(ISBLANK('8-Process Controls'!T69),\"\",'8-Process Controls'!T69)","v":""},null,null,null,null,null,null,null,null,null,null,null,null,null,{"$f":"IF(ISBLANK('8-Process Controls'!U69),\"\",'8-Process Controls'!U69)","v":""}]
[{"$f":"IF(ISBLANK('8-Process Controls'!C70),\"\",'8-Process Controls'!C70)","v":""},{"$f":"IF(ISBLANK('8-Process Controls'!D70),\"\",'8-Process Controls'!D70)","v":""},null,{"$f":"IF(ISBLANK('8-Process Controls'!E70),\"\",'8-Process Controls'!E70)","v":""},{"$f":"IF(ISBLANK('8-Process Controls'!F70),\"\",'8-Process Controls'!F70)","v":""},{"$f":"IF(ISBLANK('8-Process Controls'!G70),\"\",IF(LEFT('8-Process Controls'!G70,1)=\"Y\",\"PT\",\"\"))","v":""},null,{"$f":"IF(ISBLANK('8-Process Controls'!S70),\"\",'8-Process Controls'!S70)","v":""},{"$f":"IF(ISBLANK('8-Process Controls'!T70),\"\",'8-Process Controls'!T70)","v":""},null,null,null,null,null,null,null,null,null,null,null,null,null,{"$f":"IF(ISBLANK('8-Process Controls'!U70),\"\",'8-Process Controls'!U70)","v":""}]
[{"$f":"IF(ISBLANK('8-Process Controls'!C71),\"\",'8-Process Controls'!C71)","v":""},{"$f":"IF(ISBLANK('8-Process Controls'!D71),\"\",'8-Process Controls'!D71)","v":""},null,{"$f":"IF(ISBLANK('8-Process Controls'!E71),\"\",'8-Process Controls'!E71)","v":""},{"$f":"IF(ISBLANK('8-Process Controls'!F71),\"\",'8-Process Controls'!F71)","v":""},{"$f":"IF(ISBLANK('8-Process Controls'!G71),\"\",IF(LEFT('8-Process Controls'!G71,1)=\"Y\",\"PT\",\"\"))","v":""},null,{"$f":"IF(ISBLANK('8-Process Controls'!S71),\"\",'8-Process Controls'!S71)","v":""},{"$f":"IF(ISBLANK('8-Process Controls'!T71),\"\",'8-Process Controls'!T71)","v":""},null,null,null,null,null,null,null,null,null,null,null,null,null,{"$f":"IF(ISBLANK('8-Process Controls'!U71),\"\",'8-Process Controls'!U71)","v":""}]
[{"$f":"IF(ISBLANK('8-Process Controls'!C72),\"\",'8-Process Controls'!C72)","v":""},{"$f":"IF(ISBLANK('8-Process Controls'!D72),\"\",'8-Process Controls'!D72)","v":""},null,{"$f":"IF(ISBLANK('8-Process Controls'!E72),\"\",'8-Process Controls'!E72)","v":""},{"$f":"IF(ISBLANK('8-Process Controls'!F72),\"\",'8-Process Controls'!F72)","v":""},{"$f":"IF(ISBLANK('8-Process Controls'!G72),\"\",IF(LEFT('8-Process Controls'!G72,1)=\"Y\",\"PT\",\"\"))","v":""},null,{"$f":"IF(ISBLANK('8-Process Controls'!S72),\"\",'8-Process Controls'!S72)","v":""},{"$f":"IF(ISBLANK('8-Process Controls'!T72),\"\",'8-Process Controls'!T72)","v":""},null,null,null,null,null,null,null,null,null,null,null,null,null,{"$f":"IF(ISBLANK('8-Process Controls'!U72),\"\",'8-Process Controls'!U72)","v":""}]
[{"$f":"IF(ISBLANK('8-Process Controls'!C73),\"\",'8-Process Controls'!C73)","v":""},{"$f":"IF(ISBLANK('8-Process Controls'!D73),\"\",'8-Process Controls'!D73)","v":""},null,{"$f":"IF(ISBLANK('8-Process Controls'!E73),\"\",'8-Process Controls'!E73)","v":""},{"$f":"IF(ISBLANK('8-Process Controls'!F73),\"\",'8-Process Controls'!F73)","v":""},{"$f":"IF(ISBLANK('8-Process Controls'!G73),\"\",IF(LEFT('8-Process Controls'!G73,1)=\"Y\",\"PT\",\"\"))","v":""},null,{"$f":"IF(ISBLANK('8-Process Controls'!S73),\"\",'8-Process Controls'!S73)","v":""},{"$f":"IF(ISBLANK('8-Process Controls'!T73),\"\",'8-Process Controls'!T73)","v":""},null,null,null,null,null,null,null,null,null,null,null,null,null,{"$f":"IF(ISBLANK('8-Process Controls'!U73),\"\",'8-Process Controls'!U73)","v":""}]
[{"$f":"IF(ISBLANK('8-Process Controls'!C74),\"\",'8-Process Controls'!C74)","v":""},{"$f":"IF(ISBLANK('8-Process Controls'!D74),\"\",'8-Process Controls'!D74)","v":""},null,{"$f":"IF(ISBLANK('8-Process Controls'!E74),\"\",'8-Process Controls'!E74)","v":""},{"$f":"IF(ISBLANK('8-Process Controls'!F74),\"\",'8-Process Controls'!F74)","v":""},{"$f":"IF(ISBLANK('8-Process Controls'!G74),\"\",IF(LEFT('8-Process Controls'!G74,1)=\"Y\",\"PT\",\"\"))","v":""},null,{"$f":"IF(ISBLANK('8-Process Controls'!S74),\"\",'8-Process Controls'!S74)","v":""},{"$f":"IF(ISBLANK('8-Process Controls'!T74),\"\",'8-Process Controls'!T74)","v":""},null,null,null,null,null,null,null,null,null,null,null,null,null,{"$f":"IF(ISBLANK('8-Process Controls'!U74),\"\",'8-Process Controls'!U74)","v":""}]
[{"$f":"IF(ISBLANK('8-Process Controls'!C75),\"\",'8-Process Controls'!C75)","v":""},{"$f":"IF(ISBLANK('8-Process Controls'!D75),\"\",'8-Process Controls'!D75)","v":""},null,{"$f":"IF(ISBLANK('8-Process Controls'!E75),\"\",'8-Process Controls'!E75)","v":""},{"$f":"IF(ISBLANK('8-Process Controls'!F75),\"\",'8-Process Controls'!F75)","v":""},{"$f":"IF(ISBLANK('8-Process Controls'!G75),\"\",IF(LEFT('8-Process Controls'!G75,1)=\"Y\",\"PT\",\"\"))","v":""},null,{"$f":"IF(ISBLANK('8-Process Controls'!S75),\"\",'8-Process Controls'!S75)","v":""},{"$f":"IF(ISBLANK('8-Process Controls'!T75),\"\",'8-Process Controls'!T75)","v":""},null,null,null,null,null,null,null,null,null,null,null,null,null,{"$f":"IF(ISBLANK('8-Process Controls'!U75),\"\",'8-Process Controls'!U75)","v":""}]
[{"$f":"IF(ISBLANK('8-Process Controls'!C76),\"\",'8-Process Controls'!C76)","v":""},{"$f":"IF(ISBLANK('8-Process Controls'!D76),\"\",'8-Process Controls'!D76)","v":""},null,{"$f":"IF(ISBLANK('8-Process Controls'!E76),\"\",'8-Process Controls'!E76)","v":""},{"$f":"IF(ISBLANK('8-Process Controls'!F76),\"\",'8-Process Controls'!F76)","v":""},{"$f":"IF(ISBLANK('8-Process Controls'!G76),\"\",IF(LEFT('8-Process Controls'!G76,1)=\"Y\",\"PT\",\"\"))","v":""},null,{"$f":"IF(ISBLANK('8-Process Controls'!S76),\"\",'8-Process Controls'!S76)","v":""},{"$f":"IF(ISBLANK('8-Process Controls'!T76),\"\",'8-Process Controls'!T76)","v":""},null,null,null,null,null,null,null,null,null,null,null,null,null,{"$f":"IF(ISBLANK('8-Process Controls'!U76),\"\",'8-Process Controls'!U76)","v":""}]
[{"$f":"IF(ISBLANK('8-Process Controls'!C77),\"\",'8-Process Controls'!C77)","v":""},{"$f":"IF(ISBLANK('8-Process Controls'!D77),\"\",'8-Process Controls'!D77)","v":""},null,{"$f":"IF(ISBLANK('8-Process Controls'!E77),\"\",'8-Process Controls'!E77)","v":""},{"$f":"IF(ISBLANK('8-Process Controls'!F77),\"\",'8-Process Controls'!F77)","v":""},{"$f":"IF(ISBLANK('8-Process Controls'!G77),\"\",IF(LEFT('8-Process Controls'!G77,1)=\"Y\",\"PT\",\"\"))","v":""},null,{"$f":"IF(ISBLANK('8-Process Controls'!S77),\"\",'8-Process Controls'!S77)","v":""},{"$f":"IF(ISBLANK('8-Process Controls'!T77),\"\",'8-Process Controls'!T77)","v":""},null,null,null,null,null,null,null,null,null,null,null,null,null,{"$f":"IF(ISBLANK('8-Process Controls'!U77),\"\",'8-Process Controls'!U77)","v":""}]
[{"$f":"IF(ISBLANK('8-Process Controls'!C78),\"\",'8-Process Controls'!C78)","v":""},{"$f":"IF(ISBLANK('8-Process Controls'!D78),\"\",'8-Process Controls'!D78)","v":""},null,{"$f":"IF(ISBLANK('8-Process Controls'!E78),\"\",'8-Process Controls'!E78)","v":""},{"$f":"IF(ISBLANK('8-Process Controls'!F78),\"\",'8-Process Controls'!F78)","v":""},{"$f":"IF(ISBLANK('8-Process Controls'!G78),\"\",IF(LEFT('8-Process Controls'!G78,1)=\"Y\",\"PT\",\"\"))","v":""},null,{"$f":"IF(ISBLANK('8-Process Controls'!S78),\"\",'8-Process Controls'!S78)","v":""},{"$f":"IF(ISBLANK('8-Process Controls'!T78),\"\",'8-Process Controls'!T78)","v":""},null,null,null,null,null,null,null,null,null,null,null,null,null,{"$f":"IF(ISBLANK('8-Process Controls'!U78),\"\",'8-Process Controls'!U78)","v":""}]
[{"$f":"IF(ISBLANK('8-Process Controls'!C79),\"\",'8-Process Controls'!C79)","v":""},{"$f":"IF(ISBLANK('8-Process Controls'!D79),\"\",'8-Process Controls'!D79)","v":""},null,{"$f":"IF(ISBLANK('8-Process Controls'!E79),\"\",'8-Process Controls'!E79)","v":""},{"$f":"IF(ISBLANK('8-Process Controls'!F79),\"\",'8-Process Controls'!F79)","v":""},{"$f":"IF(ISBLANK('8-Process Controls'!G79),\"\",IF(LEFT('8-Process Controls'!G79,1)=\"Y\",\"PT\",\"\"))","v":""},null,{"$f":"IF(ISBLANK('8-Process Controls'!S79),\"\",'8-Process Controls'!S79)","v":""},{"$f":"IF(ISBLANK('8-Process Controls'!T79),\"\",'8-Process Controls'!T79)","v":""},null,null,null,null,null,null,null,null,null,null,null,null,null,{"$f":"IF(ISBLANK('8-Process Controls'!U79),\"\",'8-Process Controls'!U79)","v":""}]
[{"$f":"IF(ISBLANK('8-Process Controls'!C80),\"\",'8-Process Controls'!C80)","v":""},{"$f":"IF(ISBLANK('8-Process Controls'!D80),\"\",'8-Process Controls'!D80)","v":""},null,{"$f":"IF(ISBLANK('8-Process Controls'!E80),\"\",'8-Process Controls'!E80)","v":""},{"$f":"IF(ISBLANK('8-Process Controls'!F80),\"\",'8-Process Controls'!F80)","v":""},{"$f":"IF(ISBLANK('8-Process Controls'!G80),\"\",IF(LEFT('8-Process Controls'!G80,1)=\"Y\",\"PT\",\"\"))","v":""},null,{"$f":"IF(ISBLANK('8-Process Controls'!S80),\"\",'8-Process Controls'!S80)","v":""},{"$f":"IF(ISBLANK('8-Process Controls'!T80),\"\",'8-Process Controls'!T80)","v":""},null,null,null,null,null,null,null,null,null,null,null,null,null,{"$f":"IF(ISBLANK('8-Process Controls'!U80),\"\",'8-Process Controls'!U80)","v":""}]
[{"$f":"IF(ISBLANK('8-Process Controls'!C81),\"\",'8-Process Controls'!C81)","v":""},{"$f":"IF(ISBLANK('8-Process Controls'!D81),\"\",'8-Process Controls'!D81)","v":""},null,{"$f":"IF(ISBLANK('8-Process Controls'!E81),\"\",'8-Process Controls'!E81)","v":""},{"$f":"IF(ISBLANK('8-Process Controls'!F81),\"\",'8-Process Controls'!F81)","v":""},{"$f":"IF(ISBLANK('8-Process Controls'!G81),\"\",IF(LEFT('8-Process Controls'!G81,1)=\"Y\",\"PT\",\"\"))","v":""},null,{"$f":"IF(ISBLANK('8-Process Controls'!S81),\"\",'8-Process Controls'!S81)","v":""},{"$f":"IF(ISBLANK('8-Process Controls'!T81),\"\",'8-Process Controls'!T81)","v":""},null,null,null,null,null,null,null,null,null,null,null,null,null,{"$f":"IF(ISBLANK('8-Process Controls'!U81),\"\",'8-Process Controls'!U81)","v":""}]
[{"$f":"IF(ISBLANK('8-Process Controls'!C82),\"\",'8-Process Controls'!C82)","v":""},{"$f":"IF(ISBLANK('8-Process Controls'!D82),\"\",'8-Process Controls'!D82)","v":""},null,{"$f":"IF(ISBLANK('8-Process Controls'!E82),\"\",'8-Process Controls'!E82)","v":""},{"$f":"IF(ISBLANK('8-Process Controls'!F82),\"\",'8-Process Controls'!F82)","v":""},{"$f":"IF(ISBLANK('8-Process Controls'!G82),\"\",IF(LEFT('8-Process Controls'!G82,1)=\"Y\",\"PT\",\"\"))","v":""},null,{"$f":"IF(ISBLANK('8-Process Controls'!S82),\"\",'8-Process Controls'!S82)","v":""},{"$f":"IF(ISBLANK('8-Process Controls'!T82),\"\",'8-Process Controls'!T82)","v":""},null,null,null,null,null,null,null,null,null,null,null,null,null,{"$f":"IF(ISBLANK('8-Process Controls'!U82),\"\",'8-Process Controls'!U82)","v":""}]
[{"$f":"IF(ISBLANK('8-Process Controls'!C83),\"\",'8-Process Controls'!C83)","v":""},{"$f":"IF(ISBLANK('8-Process Controls'!D83),\"\",'8-Process Controls'!D83)","v":""},null,{"$f":"IF(ISBLANK('8-Process Controls'!E83),\"\",'8-Process Controls'!E83)","v":""},{"$f":"IF(ISBLANK('8-Process Controls'!F83),\"\",'8-Process Controls'!F83)","v":""},{"$f":"IF(ISBLANK('8-Process Controls'!G83),\"\",IF(LEFT('8-Process Controls'!G83,1)=\"Y\",\"PT\",\"\"))","v":""},null,{"$f":"IF(ISBLANK('8-Process Controls'!S83),\"\",'8-Process Controls'!S83)","v":""},{"$f":"IF(ISBLANK('8-Process Controls'!T83),\"\",'8-Process Controls'!T83)","v":""},null,null,null,null,null,null,null,null,null,null,null,null,null,{"$f":"IF(ISBLANK('8-Process Controls'!U83),\"\",'8-Process Controls'!U83)","v":""}]
[{"$f":"IF(ISBLANK('8-Process Controls'!C84),\"\",'8-Process Controls'!C84)","v":""},{"$f":"IF(ISBLANK('8-Process Controls'!D84),\"\",'8-Process Controls'!D84)","v":""},null,{"$f":"IF(ISBLANK('8-Process Controls'!E84),\"\",'8-Process Controls'!E84)","v":""},{"$f":"IF(ISBLANK('8-Process Controls'!F84),\"\",'8-Process Controls'!F84)","v":""},{"$f":"IF(ISBLANK('8-Process Controls'!G84),\"\",IF(LEFT('8-Process Controls'!G84,1)=\"Y\",\"PT\",\"\"))","v":""},null,{"$f":"IF(ISBLANK('8-Process Controls'!S84),\"\",'8-Process Controls'!S84)","v":""},{"$f":"IF(ISBLANK('8-Process Controls'!T84),\"\",'8-Process Controls'!T84)","v":""},null,null,null,null,null,null,null,null,null,null,null,null,null,{"$f":"IF(ISBLANK('8-Process Controls'!U84),\"\",'8-Process Controls'!U84)","v":""}]
[{"$f":"IF(ISBLANK('8-Process Controls'!C85),\"\",'8-Process Controls'!C85)","v":""},{"$f":"IF(ISBLANK('8-Process Controls'!D85),\"\",'8-Process Controls'!D85)","v":""},null,{"$f":"IF(ISBLANK('8-Process Controls'!E85),\"\",'8-Process Controls'!E85)","v":""},{"$f":"IF(ISBLANK('8-Process Controls'!F85),\"\",'8-Process Controls'!F85)","v":""},{"$f":"IF(ISBLANK('8-Process Controls'!G85),\"\",IF(LEFT('8-Process Controls'!G85,1)=\"Y\",\"PT\",\"\"))","v":""},null,{"$f":"IF(ISBLANK('8-Process Controls'!S85),\"\",'8-Process Controls'!S85)","v":""},{"$f":"IF(ISBLANK('8-Process Controls'!T85),\"\",'8-Process Controls'!T85)","v":""},null,null,null,null,null,null,null,null,null,null,null,null,null,{"$f":"IF(ISBLANK('8-Process Controls'!U85),\"\",'8-Process Controls'!U85)","v":""}]
[{"$f":"IF(ISBLANK('8-Process Controls'!C86),\"\",'8-Process Controls'!C86)","v":""},{"$f":"IF(ISBLANK('8-Process Controls'!D86),\"\",'8-Process Controls'!D86)","v":""},null,{"$f":"IF(ISBLANK('8-Process Controls'!E86),\"\",'8-Process Controls'!E86)","v":""},{"$f":"IF(ISBLANK('8-Process Controls'!F86),\"\",'8-Process Controls'!F86)","v":""},{"$f":"IF(ISBLANK('8-Process Controls'!G86),\"\",IF(LEFT('8-Process Controls'!G86,1)=\"Y\",\"PT\",\"\"))","v":""},null,{"$f":"IF(ISBLANK('8-Process Controls'!S86),\"\",'8-Process Controls'!S86)","v":""},{"$f":"IF(ISBLANK('8-Process Controls'!T86),\"\",'8-Process Controls'!T86)","v":""},null,null,null,null,null,null,null,null,null,null,null,null,null,{"$f":"IF(ISBLANK('8-Process Controls'!U86),\"\",'8-Process Controls'!U86)","v":""}]
[{"$f":"IF(ISBLANK('8-Process Controls'!C87),\"\",'8-Process Controls'!C87)","v":""},{"$f":"IF(ISBLANK('8-Process Controls'!D87),\"\",'8-Process Controls'!D87)","v":""},null,{"$f":"IF(ISBLANK('8-Process Controls'!E87),\"\",'8-Process Controls'!E87)","v":""},{"$f":"IF(ISBLANK('8-Process Controls'!F87),\"\",'8-Process Controls'!F87)","v":""},{"$f":"IF(ISBLANK('8-Process Controls'!G87),\"\",IF(LEFT('8-Process Controls'!G87,1)=\"Y\",\"PT\",\"\"))","v":""},null,{"$f":"IF(ISBLANK('8-Process Controls'!S87),\"\",'8-Process Controls'!S87)","v":""},{"$f":"IF(ISBLANK('8-Process Controls'!T87),\"\",'8-Process Controls'!T87)","v":""},null,null,null,null,null,null,null,null,null,null,null,null,null,{"$f":"IF(ISBLANK('8-Process Controls'!U87),\"\",'8-Process Controls'!U87)","v":""}]
[{"$f":"IF(ISBLANK('8-Process Controls'!C88),\"\",'8-Process Controls'!C88)","v":""},{"$f":"IF(ISBLANK('8-Process Controls'!D88),\"\",'8-Process Controls'!D88)","v":""},null,{"$f":"IF(ISBLANK('8-Process Controls'!E88),\"\",'8-Process Controls'!E88)","v":""},{"$f":"IF(ISBLANK('8-Process Controls'!F88),\"\",'8-Process Controls'!F88)","v":""},{"$f":"IF(ISBLANK('8-Process Controls'!G88),\"\",IF(LEFT('8-Process Controls'!G88,1)=\"Y\",\"PT\",\"\"))","v":""},null,{"$f":"IF(ISBLANK('8-Process Controls'!S88),\"\",'8-Process Controls'!S88)","v":""},{"$f":"IF(ISBLANK('8-Process Controls'!T88),\"\",'8-Process Controls'!T88)","v":""},null,null,null,null,null,null,null,null,null,null,null,null,null,{"$f":"IF(ISBLANK('8-Process Controls'!U88),\"\",'8-Process Controls'!U88)","v":""}]
[{"$f":"IF(ISBLANK('8-Process Controls'!C89),\"\",'8-Process Controls'!C89)","v":""},{"$f":"IF(ISBLANK('8-Process Controls'!D89),\"\",'8-Process Controls'!D89)","v":""},null,{"$f":"IF(ISBLANK('8-Process Controls'!E89),\"\",'8-Process Controls'!E89)","v":""},{"$f":"IF(ISBLANK('8-Process Controls'!F89),\"\",'8-Process Controls'!F89)","v":""},{"$f":"IF(ISBLANK('8-Process Controls'!G89),\"\",IF(LEFT('8-Process Controls'!G89,1)=\"Y\",\"PT\",\"\"))","v":""},null,{"$f":"IF(ISBLANK('8-Process Controls'!S89),\"\",'8-Process Controls'!S89)","v":""},{"$f":"IF(ISBLANK('8-Process Controls'!T89),\"\",'8-Process Controls'!T89)","v":""},null,null,null,null,null,null,null,null,null,null,null,null,null,{"$f":"IF(ISBLANK('8-Process Controls'!U89),\"\",'8-Process Controls'!U89)","v":""}]
[{"$f":"IF(ISBLANK('8-Process Controls'!C90),\"\",'8-Process Controls'!C90)","v":""},{"$f":"IF(ISBLANK('8-Process Controls'!D90),\"\",'8-Process Controls'!D90)","v":""},null,{"$f":"IF(ISBLANK('8-Process Controls'!E90),\"\",'8-Process Controls'!E90)","v":""},{"$f":"IF(ISBLANK('8-Process Controls'!F90),\"\",'8-Process Controls'!F90)","v":""},{"$f":"IF(ISBLANK('8-Process Controls'!G90),\"\",IF(LEFT('8-Process Controls'!G90,1)=\"Y\",\"PT\",\"\"))","v":""},null,{"$f":"IF(ISBLANK('8-Process Controls'!S90),\"\",'8-Process Controls'!S90)","v":""},{"$f":"IF(ISBLANK('8-Process Controls'!T90),\"\",'8-Process Controls'!T90)","v":""},null,null,null,null,null,null,null,null,null,null,null,null,null,{"$f":"IF(ISBLANK('8-Process Controls'!U90),\"\",'8-Process Controls'!U90)","v":""}]
[{"$f":"IF(ISBLANK('8-Process Controls'!C91),\"\",'8-Process Controls'!C91)","v":""},{"$f":"IF(ISBLANK('8-Process Controls'!D91),\"\",'8-Process Controls'!D91)","v":""},null,{"$f":"IF(ISBLANK('8-Process Controls'!E91),\"\",'8-Process Controls'!E91)","v":""},{"$f":"IF(ISBLANK('8-Process Controls'!F91),\"\",'8-Process Controls'!F91)","v":""},{"$f":"IF(ISBLANK('8-Process Controls'!G91),\"\",IF(LEFT('8-Process Controls'!G91,1)=\"Y\",\"PT\",\"\"))","v":""},null,{"$f":"IF(ISBLANK('8-Process Controls'!S91),\"\",'8-Process Controls'!S91)","v":""},{"$f":"IF(ISBLANK('8-Process Controls'!T91),\"\",'8-Process Controls'!T91)","v":""},null,null,null,null,null,null,null,null,null,null,null,null,null,{"$f":"IF(ISBLANK('8-Process Controls'!U91),\"\",'8-Process Controls'!U91)","v":""}]
[{"$f":"IF(ISBLANK('8-Process Controls'!C92),\"\",'8-Process Controls'!C92)","v":""},{"$f":"IF(ISBLANK('8-Process Controls'!D92),\"\",'8-Process Controls'!D92)","v":""},null,{"$f":"IF(ISBLANK('8-Process Controls'!E92),\"\",'8-Process Controls'!E92)","v":""},{"$f":"IF(ISBLANK('8-Process Controls'!F92),\"\",'8-Process Controls'!F92)","v":""},{"$f":"IF(ISBLANK('8-Process Controls'!G92),\"\",IF(LEFT('8-Process Controls'!G92,1)=\"Y\",\"PT\",\"\"))","v":""},null,{"$f":"IF(ISBLANK('8-Process Controls'!S92),\"\",'8-Process Controls'!S92)","v":""},{"$f":"IF(ISBLANK('8-Process Controls'!T92),\"\",'8-Process Controls'!T92)","v":""},null,null,null,null,null,null,null,null,null,null,null,null,null,{"$f":"IF(ISBLANK('8-Process Controls'!U92),\"\",'8-Process Controls'!U92)","v":""}]
[{"$f":"IF(ISBLANK('8-Process Controls'!C93),\"\",'8-Process Controls'!C93)","v":""},{"$f":"IF(ISBLANK('8-Process Controls'!D93),\"\",'8-Process Controls'!D93)","v":""},null,{"$f":"IF(ISBLANK('8-Process Controls'!E93),\"\",'8-Process Controls'!E93)","v":""},{"$f":"IF(ISBLANK('8-Process Controls'!F93),\"\",'8-Process Controls'!F93)","v":""},{"$f":"IF(ISBLANK('8-Process Controls'!G93),\"\",IF(LEFT('8-Process Controls'!G93,1)=\"Y\",\"PT\",\"\"))","v":""},null,{"$f":"IF(ISBLANK('8-Process Controls'!S93),\"\",'8-Process Controls'!S93)","v":""},{"$f":"IF(ISBLANK('8-Process Controls'!T93),\"\",'8-Process Controls'!T93)","v":""},null,null,null,null,null,null,null,null,null,null,null,null,null,{"$f":"IF(ISBLANK('8-Process Controls'!U93),\"\",'8-Process Controls'!U93)","v":""}]
[{"$f":"IF(ISBLANK('8-Process Controls'!C94),\"\",'8-Process Controls'!C94)","v":""},{"$f":"IF(ISBLANK('8-Process Controls'!D94),\"\",'8-Process Controls'!D94)","v":""},null,{"$f":"IF(ISBLANK('8-Process Controls'!E94),\"\",'8-Process Controls'!E94)","v":""},{"$f":"IF(ISBLANK('8-Process Controls'!F94),\"\",'8-Process Controls'!F94)","v":""},{"$f":"IF(ISBLANK('8-Process Controls'!G94),\"\",IF(LEFT('8-Process Controls'!G94,1)=\"Y\",\"PT\",\"\"))","v":""},null,{"$f":"IF(ISBLANK('8-Process Controls'!S94),\"\",'8-Process Controls'!S94)","v":""},{"$f":"IF(ISBLANK('8-Process Controls'!T94),\"\",'8-Process Controls'!T94)","v":""},null,null,null,null,null,null,null,null,null,null,null,null,null,{"$f":"IF(ISBLANK('8-Process Controls'!U94),\"\",'8-Process Controls'!U94)","v":""}]
[{"$f":"IF(ISBLANK('8-Process Controls'!C95),\"\",'8-Process Controls'!C95)","v":""},{"$f":"IF(ISBLANK('8-Process Controls'!D95),\"\",'8-Process Controls'!D95)","v":""},null,{"$f":"IF(ISBLANK('8-Process Controls'!E95),\"\",'8-Process Controls'!E95)","v":""},{"$f":"IF(ISBLANK('8-Process Controls'!F95),\"\",'8-Process Controls'!F95)","v":""},{"$f":"IF(ISBLANK('8-Process Controls'!G95),\"\",IF(LEFT('8-Process Controls'!G95,1)=\"Y\",\"PT\",\"\"))","v":""},null,{"$f":"IF(ISBLANK('8-Process Controls'!S95),\"\",'8-Process Controls'!S95)","v":""},{"$f":"IF(ISBLANK('8-Process Controls'!T95),\"\",'8-Process Controls'!T95)","v":""},null,null,null,null,null,null,null,null,null,null,null,null,null,{"$f":"IF(ISBLANK('8-Process Controls'!U95),\"\",'8-Process Controls'!U95)","v":""}]
[{"$f":"IF(ISBLANK('8-Process Controls'!C96),\"\",'8-Process Controls'!C96)","v":""},{"$f":"IF(ISBLANK('8-Process Controls'!D96),\"\",'8-Process Controls'!D96)","v":""},null,{"$f":"IF(ISBLANK('8-Process Controls'!E96),\"\",'8-Process Controls'!E96)","v":""},{"$f":"IF(ISBLANK('8-Process Controls'!F96),\"\",'8-Process Controls'!F96)","v":""},{"$f":"IF(ISBLANK('8-Process Controls'!G96),\"\",IF(LEFT('8-Process Controls'!G96,1)=\"Y\",\"PT\",\"\"))","v":""},null,{"$f":"IF(ISBLANK('8-Process Controls'!S96),\"\",'8-Process Controls'!S96)","v":""},{"$f":"IF(ISBLANK('8-Process Controls'!T96),\"\",'8-Process Controls'!T96)","v":""},null,null,null,null,null,null,null,null,null,null,null,null,null,{"$f":"IF(ISBLANK('8-Process Controls'!U96),\"\",'8-Process Controls'!U96)","v":""}]
[{"$f":"IF(ISBLANK('8-Process Controls'!C97),\"\",'8-Process Controls'!C97)","v":""},{"$f":"IF(ISBLANK('8-Process Controls'!D97),\"\",'8-Process Controls'!D97)","v":""},null,{"$f":"IF(ISBLANK('8-Process Controls'!E97),\"\",'8-Process Controls'!E97)","v":""},{"$f":"IF(ISBLANK('8-Process Controls'!F97),\"\",'8-Process Controls'!F97)","v":""},{"$f":"IF(ISBLANK('8-Process Controls'!G97),\"\",IF(LEFT('8-Process Controls'!G97,1)=\"Y\",\"PT\",\"\"))","v":""},null,{"$f":"IF(ISBLANK('8-Process Controls'!S97),\"\",'8-Process Controls'!S97)","v":""},{"$f":"IF(ISBLANK('8-Process Controls'!T97),\"\",'8-Process Controls'!T97)","v":""},null,null,null,null,null,null,null,null,null,null,null,null,null,{"$f":"IF(ISBLANK('8-Process Controls'!U97),\"\",'8-Process Controls'!U97)","v":""}]
[{"$f":"IF(ISBLANK('8-Process Controls'!C98),\"\",'8-Process Controls'!C98)","v":""},{"$f":"IF(ISBLANK('8-Process Controls'!D98),\"\",'8-Process Controls'!D98)","v":""},null,{"$f":"IF(ISBLANK('8-Process Controls'!E98),\"\",'8-Process Controls'!E98)","v":""},{"$f":"IF(ISBLANK('8-Process Controls'!F98),\"\",'8-Process Controls'!F98)","v":""},{"$f":"IF(ISBLANK('8-Process Controls'!G98),\"\",IF(LEFT('8-Process Controls'!G98,1)=\"Y\",\"PT\",\"\"))","v":""},null,{"$f":"IF(ISBLANK('8-Process Controls'!S98),\"\",'8-Process Controls'!S98)","v":""},{"$f":"IF(ISBLANK('8-Process Controls'!T98),\"\",'8-Process Controls'!T98)","v":""},null,null,null,null,null,null,null,null,null,null,null,null,null,{"$f":"IF(ISBLANK('8-Process Controls'!U98),\"\",'8-Process Controls'!U98)","v":""}]
[{"$f":"IF(ISBLANK('8-Process Controls'!C99),\"\",'8-Process Controls'!C99)","v":""},{"$f":"IF(ISBLANK('8-Process Controls'!D99),\"\",'8-Process Controls'!D99)","v":""},null,{"$f":"IF(ISBLANK('8-Process Controls'!E99),\"\",'8-Process Controls'!E99)","v":""},{"$f":"IF(ISBLANK('8-Process Controls'!F99),\"\",'8-Process Controls'!F99)","v":""},{"$f":"IF(ISBLANK('8-Process Controls'!G99),\"\",IF(LEFT('8-Process Controls'!G99,1)=\"Y\",\"PT\",\"\"))","v":""},null,{"$f":"IF(ISBLANK('8-Process Controls'!S99),\"\",'8-Process Controls'!S99)","v":""},{"$f":"IF(ISBLANK('8-Process Controls'!T99),\"\",'8-Process Controls'!T99)","v":""},null,null,null,null,null,null,null,null,null,null,null,null,null,{"$f":"IF(ISBLANK('8-Process Controls'!U99),\"\",'8-Process Controls'!U99)","v":""}]
[{"$f":"IF(ISBLANK('8-Process Controls'!C100),\"\",'8-Process Controls'!C100)","v":""},{"$f":"IF(ISBLANK('8-Process Controls'!D100),\"\",'8-Process Controls'!D100)","v":""},null,{"$f":"IF(ISBLANK('8-Process Controls'!E100),\"\",'8-Process Controls'!E100)","v":""},{"$f":"IF(ISBLANK('8-Process Controls'!F100),\"\",'8-Process Controls'!F100)","v":""},{"$f":"IF(ISBLANK('8-Process Controls'!G100),\"\",IF(LEFT('8-Process Controls'!G100,1)=\"Y\",\"PT\",\"\"))","v":""},null,{"$f":"IF(ISBLANK('8-Process Controls'!S100),\"\",'8-Process Controls'!S100)","v":""},{"$f":"IF(ISBLANK('8-Process Controls'!T100),\"\",'8-Process Controls'!T100)","v":""},null,null,null,null,null,null,null,null,null,null,null,null,null,{"$f":"IF(ISBLANK('8-Process Controls'!U100),\"\",'8-Process Controls'!U100)","v":""}]
[{"$f":"IF(ISBLANK('8-Process Controls'!C101),\"\",'8-Process Controls'!C101)","v":""},{"$f":"IF(ISBLANK('8-Process Controls'!D101),\"\",'8-Process Controls'!D101)","v":""},null,{"$f":"IF(ISBLANK('8-Process Controls'!E101),\"\",'8-Process Controls'!E101)","v":""},{"$f":"IF(ISBLANK('8-Process Controls'!F101),\"\",'8-Process Controls'!F101)","v":""},{"$f":"IF(ISBLANK('8-Process Controls'!G101),\"\",IF(LEFT('8-Process Controls'!G101,1)=\"Y\",\"PT\",\"\"))","v":""},null,{"$f":"IF(ISBLANK('8-Process Controls'!S101),\"\",'8-Process Controls'!S101)","v":""},{"$f":"IF(ISBLANK('8-Process Controls'!T101),\"\",'8-Process Controls'!T101)","v":""},null,null,null,null,null,null,null,null,null,null,null,null,null,{"$f":"IF(ISBLANK('8-Process Controls'!U101),\"\",'8-Process Controls'!U101)","v":""}]
[{"$f":"IF(ISBLANK('8-Process Controls'!C102),\"\",'8-Process Controls'!C102)","v":""},{"$f":"IF(ISBLANK('8-Process Controls'!D102),\"\",'8-Process Controls'!D102)","v":""},null,{"$f":"IF(ISBLANK('8-Process Controls'!E102),\"\",'8-Process Controls'!E102)","v":""},{"$f":"IF(ISBLANK('8-Process Controls'!F102),\"\",'8-Process Controls'!F102)","v":""},{"$f":"IF(ISBLANK('8-Process Controls'!G102),\"\",IF(LEFT('8-Process Controls'!G102,1)=\"Y\",\"PT\",\"\"))","v":""},null,{"$f":"IF(ISBLANK('8-Process Controls'!S102),\"\",'8-Process Controls'!S102)","v":""},{"$f":"IF(ISBLANK('8-Process Controls'!T102),\"\",'8-Process Controls'!T102)","v":""},null,null,null,null,null,null,null,null,null,null,null,null,null,{"$f":"IF(ISBLANK('8-Process Controls'!U102),\"\",'8-Process Controls'!U102)","v":""}]
[{"$f":"IF(ISBLANK('8-Process Controls'!C103),\"\",'8-Process Controls'!C103)","v":""},{"$f":"IF(ISBLANK('8-Process Controls'!D103),\"\",'8-Process Controls'!D103)","v":""},null,{"$f":"IF(ISBLANK('8-Process Controls'!E103),\"\",'8-Process Controls'!E103)","v":""},{"$f":"IF(ISBLANK('8-Process Controls'!F103),\"\",'8-Process Controls'!F103)","v":""},{"$f":"IF(ISBLANK('8-Process Controls'!G103),\"\",IF(LEFT('8-Process Controls'!G103,1)=\"Y\",\"PT\",\"\"))","v":""},null,{"$f":"IF(ISBLANK('8-Process Controls'!S103),\"\",'8-Process Controls'!S103)","v":""},{"$f":"IF(ISBLANK('8-Process Controls'!T103),\"\",'8-Process Controls'!T103)","v":""},null,null,null,null,null,null,null,null,null,null,null,null,null,{"$f":"IF(ISBLANK('8-Process Controls'!U103),\"\",'8-Process Controls'!U103)","v":""}]
[{"$f":"IF(ISBLANK('8-Process Controls'!C104),\"\",'8-Process Controls'!C104)","v":""},{"$f":"IF(ISBLANK('8-Process Controls'!D104),\"\",'8-Process Controls'!D104)","v":""},null,{"$f":"IF(ISBLANK('8-Process Controls'!E104),\"\",'8-Process Controls'!E104)","v":""},{"$f":"IF(ISBLANK('8-Process Controls'!F104),\"\",'8-Process Controls'!F104)","v":""},{"$f":"IF(ISBLANK('8-Process Controls'!G104),\"\",IF(LEFT('8-Process Controls'!G104,1)=\"Y\",\"PT\",\"\"))","v":""},null,{"$f":"IF(ISBLANK('8-Process Controls'!S104),\"\",'8-Process Controls'!S104)","v":""},{"$f":"IF(ISBLANK('8-Process Controls'!T104),\"\",'8-Process Controls'!T104)","v":""},null,null,null,null,null,null,null,null,null,null,null,null,null,{"$f":"IF(ISBLANK('8-Process Controls'!U104),\"\",'8-Process Controls'!U104)","v":""}]
[{"$f":"IF(ISBLANK('8-Process Controls'!C105),\"\",'8-Process Controls'!C105)","v":""},{"$f":"IF(ISBLANK('8-Process Controls'!D105),\"\",'8-Process Controls'!D105)","v":""},null,{"$f":"IF(ISBLANK('8-Process Controls'!E105),\"\",'8-Process Controls'!E105)","v":""},{"$f":"IF(ISBLANK('8-Process Controls'!F105),\"\",'8-Process Controls'!F105)","v":""},{"$f":"IF(ISBLANK('8-Process Controls'!G105),\"\",IF(LEFT('8-Process Controls'!G105,1)=\"Y\",\"PT\",\"\"))","v":""},null,{"$f":"IF(ISBLANK('8-Process Controls'!S105),\"\",'8-Process Controls'!S105)","v":""},{"$f":"IF(ISBLANK('8-Process Controls'!T105),\"\",'8-Process Controls'!T105)","v":""},null,null,null,null,null,null,null,null,null,null,null,null,null,{"$f":"IF(ISBLANK('8-Process Controls'!U105),\"\",'8-Process Controls'!U105)","v":""}]
[{"$f":"IF(ISBLANK('8-Process Controls'!C106),\"\",'8-Process Controls'!C106)","v":""},{"$f":"IF(ISBLANK('8-Process Controls'!D106),\"\",'8-Process Controls'!D106)","v":""},null,{"$f":"IF(ISBLANK('8-Process Controls'!E106),\"\",'8-Process Controls'!E106)","v":""},{"$f":"IF(ISBLANK('8-Process Controls'!F106),\"\",'8-Process Controls'!F106)","v":""},{"$f":"IF(ISBLANK('8-Process Controls'!G106),\"\",IF(LEFT('8-Process Controls'!G106,1)=\"Y\",\"PT\",\"\"))","v":""},null,{"$f":"IF(ISBLANK('8-Process Controls'!S106),\"\",'8-Process Controls'!S106)","v":""},{"$f":"IF(ISBLANK('8-Process Controls'!T106),\"\",'8-Process Controls'!T106)","v":""},null,null,null,null,null,null,null,null,null,null,null,null,null,{"$f":"IF(ISBLANK('8-Process Controls'!U106),\"\",'8-Process Controls'!U106)","v":""}]
[{"$f":"IF(ISBLANK('8-Process Controls'!C107),\"\",'8-Process Controls'!C107)","v":""},{"$f":"IF(ISBLANK('8-Process Controls'!D107),\"\",'8-Process Controls'!D107)","v":""},null,{"$f":"IF(ISBLANK('8-Process Controls'!E107),\"\",'8-Process Controls'!E107)","v":""},{"$f":"IF(ISBLANK('8-Process Controls'!F107),\"\",'8-Process Controls'!F107)","v":""},{"$f":"IF(ISBLANK('8-Process Controls'!G107),\"\",IF(LEFT('8-Process Controls'!G107,1)=\"Y\",\"PT\",\"\"))","v":""},null,{"$f":"IF(ISBLANK('8-Process Controls'!S107),\"\",'8-Process Controls'!S107)","v":""},{"$f":"IF(ISBLANK('8-Process Controls'!T107),\"\",'8-Process Controls'!T107)","v":""},null,null,null,null,null,null,null,null,null,null,null,null,null,{"$f":"IF(ISBLANK('8-Process Controls'!U107),\"\",'8-Process Controls'!U107)","v":""}]
[{"$f":"IF(ISBLANK('8-Process Controls'!C108),\"\",'8-Process Controls'!C108)","v":""},{"$f":"IF(ISBLANK('8-Process Controls'!D108),\"\",'8-Process Controls'!D108)","v":""},null,{"$f":"IF(ISBLANK('8-Process Controls'!E108),\"\",'8-Process Controls'!E108)","v":""},{"$f":"IF(ISBLANK('8-Process Controls'!F108),\"\",'8-Process Controls'!F108)","v":""},{"$f":"IF(ISBLANK('8-Process Controls'!G108),\"\",IF(LEFT('8-Process Controls'!G108,1)=\"Y\",\"PT\",\"\"))","v":""},null,{"$f":"IF(ISBLANK('8-Process Controls'!S108),\"\",'8-Process Controls'!S108)","v":""},{"$f":"IF(ISBLANK('8-Process Controls'!T108),\"\",'8-Process Controls'!T108)","v":""},null,null,null,null,null,null,null,null,null,null,null,null,null,{"$f":"IF(ISBLANK('8-Process Controls'!U108),\"\",'8-Process Controls'!U108)","v":""}]
[{"$f":"IF(ISBLANK('8-Process Controls'!C109),\"\",'8-Process Controls'!C109)","v":""},{"$f":"IF(ISBLANK('8-Process Controls'!D109),\"\",'8-Process Controls'!D109)","v":""},null,{"$f":"IF(ISBLANK('8-Process Controls'!E109),\"\",'8-Process Controls'!E109)","v":""},{"$f":"IF(ISBLANK('8-Process Controls'!F109),\"\",'8-Process Controls'!F109)","v":""},{"$f":"IF(ISBLANK('8-Process Controls'!G109),\"\",IF(LEFT('8-Process Controls'!G109,1)=\"Y\",\"PT\",\"\"))","v":""},null,{"$f":"IF(ISBLANK('8-Process Controls'!S109),\"\",'8-Process Controls'!S109)","v":""},{"$f":"IF(ISBLANK('8-Process Controls'!T109),\"\",'8-Process Controls'!T109)","v":""},null,null,null,null,null,null,null,null,null,null,null,null,null,{"$f":"IF(ISBLANK('8-Process Controls'!U109),\"\",'8-Process Controls'!U109)","v":""}]
[{"$f":"IF(ISBLANK('8-Process Controls'!C110),\"\",'8-Process Controls'!C110)","v":""},{"$f":"IF(ISBLANK('8-Process Controls'!D110),\"\",'8-Process Controls'!D110)","v":""},null,{"$f":"IF(ISBLANK('8-Process Controls'!E110),\"\",'8-Process Controls'!E110)","v":""},{"$f":"IF(ISBLANK('8-Process Controls'!F110),\"\",'8-Process Controls'!F110)","v":""},{"$f":"IF(ISBLANK('8-Process Controls'!G110),\"\",IF(LEFT('8-Process Controls'!G110,1)=\"Y\",\"PT\",\"\"))","v":""},null,{"$f":"IF(ISBLANK('8-Process Controls'!S110),\"\",'8-Process Controls'!S110)","v":""},{"$f":"IF(ISBLANK('8-Process Controls'!T110),\"\",'8-Process Controls'!T110)","v":""},null,null,null,null,null,null,null,null,null,null,null,null,null,{"$f":"IF(ISBLANK('8-Process Controls'!U110),\"\",'8-Process Controls'!U110)","v":""}]
[{"$f":"IF(ISBLANK('8-Process Controls'!C111),\"\",'8-Process Controls'!C111)","v":""},{"$f":"IF(ISBLANK('8-Process Controls'!D111),\"\",'8-Process Controls'!D111)","v":""},null,{"$f":"IF(ISBLANK('8-Process Controls'!E111),\"\",'8-Process Controls'!E111)","v":""},{"$f":"IF(ISBLANK('8-Process Controls'!F111),\"\",'8-Process Controls'!F111)","v":""},{"$f":"IF(ISBLANK('8-Process Controls'!G111),\"\",IF(LEFT('8-Process Controls'!G111,1)=\"Y\",\"PT\",\"\"))","v":""},null,{"$f":"IF(ISBLANK('8-Process Controls'!S111),\"\",'8-Process Controls'!S111)","v":""},{"$f":"IF(ISBLANK('8-Process Controls'!T111),\"\",'8-Process Controls'!T111)","v":""},null,null,null,null,null,null,null,null,null,null,null,null,null,{"$f":"IF(ISBLANK('8-Process Controls'!U111),\"\",'8-Process Controls'!U111)","v":""}]
[{"$f":"IF(ISBLANK('8-Process Controls'!C112),\"\",'8-Process Controls'!C112)","v":""},{"$f":"IF(ISBLANK('8-Process Controls'!D112),\"\",'8-Process Controls'!D112)","v":""},null,{"$f":"IF(ISBLANK('8-Process Controls'!E112),\"\",'8-Process Controls'!E112)","v":""},{"$f":"IF(ISBLANK('8-Process Controls'!F112),\"\",'8-Process Controls'!F112)","v":""},{"$f":"IF(ISBLANK('8-Process Controls'!G112),\"\",IF(LEFT('8-Process Controls'!G112,1)=\"Y\",\"PT\",\"\"))","v":""},null,{"$f":"IF(ISBLANK('8-Process Controls'!S112),\"\",'8-Process Controls'!S112)","v":""},{"$f":"IF(ISBLANK('8-Process Controls'!T112),\"\",'8-Process Controls'!T112)","v":""},null,null,null,null,null,null,null,null,null,null,null,null,null,{"$f":"IF(ISBLANK('8-Process Controls'!U112),\"\",'8-Process Controls'!U112)","v":""}]
[{"$f":"IF(ISBLANK('8-Process Controls'!C113),\"\",'8-Process Controls'!C113)","v":""},{"$f":"IF(ISBLANK('8-Process Controls'!D113),\"\",'8-Process Controls'!D113)","v":""},null,{"$f":"IF(ISBLANK('8-Process Controls'!E113),\"\",'8-Process Controls'!E113)","v":""},{"$f":"IF(ISBLANK('8-Process Controls'!F113),\"\",'8-Process Controls'!F113)","v":""},{"$f":"IF(ISBLANK('8-Process Controls'!G113),\"\",IF(LEFT('8-Process Controls'!G113,1)=\"Y\",\"PT\",\"\"))","v":""},null,{"$f":"IF(ISBLANK('8-Process Controls'!S113),\"\",'8-Process Controls'!S113)","v":""},{"$f":"IF(ISBLANK('8-Process Controls'!T113),\"\",'8-Process Controls'!T113)","v":""},null,null,null,null,null,null,null,null,null,null,null,null,null,{"$f":"IF(ISBLANK('8-Process Controls'!U113),\"\",'8-Process Controls'!U113)","v":""}]
[{"$f":"IF(ISBLANK('8-Process Controls'!C114),\"\",'8-Process Controls'!C114)","v":""},{"$f":"IF(ISBLANK('8-Process Controls'!D114),\"\",'8-Process Controls'!D114)","v":""},null,{"$f":"IF(ISBLANK('8-Process Controls'!E114),\"\",'8-Process Controls'!E114)","v":""},{"$f":"IF(ISBLANK('8-Process Controls'!F114),\"\",'8-Process Controls'!F114)","v":""},{"$f":"IF(ISBLANK('8-Process Controls'!G114),\"\",IF(LEFT('8-Process Controls'!G114,1)=\"Y\",\"PT\",\"\"))","v":""},null,{"$f":"IF(ISBLANK('8-Process Controls'!S114),\"\",'8-Process Controls'!S114)","v":""},{"$f":"IF(ISBLANK('8-Process Controls'!T114),\"\",'8-Process Controls'!T114)","v":""},null,null,null,null,null,null,null,null,null,null,null,null,null,{"$f":"IF(ISBLANK('8-Process Controls'!U114),\"\",'8-Process Controls'!U114)","v":""}]
[{"$f":"IF(ISBLANK('8-Process Controls'!C115),\"\",'8-Process Controls'!C115)","v":""},{"$f":"IF(ISBLANK('8-Process Controls'!D115),\"\",'8-Process Controls'!D115)","v":""},null,{"$f":"IF(ISBLANK('8-Process Controls'!E115),\"\",'8-Process Controls'!E115)","v":""},{"$f":"IF(ISBLANK('8-Process Controls'!F115),\"\",'8-Process Controls'!F115)","v":""},{"$f":"IF(ISBLANK('8-Process Controls'!G115),\"\",IF(LEFT('8-Process Controls'!G115,1)=\"Y\",\"PT\",\"\"))","v":""},null,{"$f":"IF(ISBLANK('8-Process Controls'!S115),\"\",'8-Process Controls'!S115)","v":""},{"$f":"IF(ISBLANK('8-Process Controls'!T115),\"\",'8-Process Controls'!T115)","v":""},null,null,null,null,null,null,null,null,null,null,null,null,null,{"$f":"IF(ISBLANK('8-Process Controls'!U115),\"\",'8-Process Controls'!U115)","v":""}]
[{"$f":"IF(ISBLANK('8-Process Controls'!C116),\"\",'8-Process Controls'!C116)","v":""},{"$f":"IF(ISBLANK('8-Process Controls'!D116),\"\",'8-Process Controls'!D116)","v":""},null,{"$f":"IF(ISBLANK('8-Process Controls'!E116),\"\",'8-Process Controls'!E116)","v":""},{"$f":"IF(ISBLANK('8-Process Controls'!F116),\"\",'8-Process Controls'!F116)","v":""},{"$f":"IF(ISBLANK('8-Process Controls'!G116),\"\",IF(LEFT('8-Process Controls'!G116,1)=\"Y\",\"PT\",\"\"))","v":""},null,{"$f":"IF(ISBLANK('8-Process Controls'!S116),\"\",'8-Process Controls'!S116)","v":""},{"$f":"IF(ISBLANK('8-Process Controls'!T116),\"\",'8-Process Controls'!T116)","v":""},null,null,null,null,null,null,null,null,null,null,null,null,null,{"$f":"IF(ISBLANK('8-Process Controls'!U116),\"\",'8-Process Controls'!U116)","v":""}]
[{"$f":"IF(ISBLANK('8-Process Controls'!C117),\"\",'8-Process Controls'!C117)","v":""},{"$f":"IF(ISBLANK('8-Process Controls'!D117),\"\",'8-Process Controls'!D117)","v":""},null,{"$f":"IF(ISBLANK('8-Process Controls'!E117),\"\",'8-Process Controls'!E117)","v":""},{"$f":"IF(ISBLANK('8-Process Controls'!F117),\"\",'8-Process Controls'!F117)","v":""},{"$f":"IF(ISBLANK('8-Process Controls'!G117),\"\",IF(LEFT('8-Process Controls'!G117,1)=\"Y\",\"PT\",\"\"))","v":""},null,{"$f":"IF(ISBLANK('8-Process Controls'!S117),\"\",'8-Process Controls'!S117)","v":""},{"$f":"IF(ISBLANK('8-Process Controls'!T117),\"\",'8-Process Controls'!T117)","v":""},null,null,null,null,null,null,null,null,null,null,null,null,null,{"$f":"IF(ISBLANK('8-Process Controls'!U117),\"\",'8-Process Controls'!U117)","v":""}]
[{"$f":"IF(ISBLANK('8-Process Controls'!C118),\"\",'8-Process Controls'!C118)","v":""},{"$f":"IF(ISBLANK('8-Process Controls'!D118),\"\",'8-Process Controls'!D118)","v":""},null,{"$f":"IF(ISBLANK('8-Process Controls'!E118),\"\",'8-Process Controls'!E118)","v":""},{"$f":"IF(ISBLANK('8-Process Controls'!F118),\"\",'8-Process Controls'!F118)","v":""},{"$f":"IF(ISBLANK('8-Process Controls'!G118),\"\",IF(LEFT('8-Process Controls'!G118,1)=\"Y\",\"PT\",\"\"))","v":""},null,{"$f":"IF(ISBLANK('8-Process Controls'!S118),\"\",'8-Process Controls'!S118)","v":""},{"$f":"IF(ISBLANK('8-Process Controls'!T118),\"\",'8-Process Controls'!T118)","v":""},null,null,null,null,null,null,null,null,null,null,null,null,null,{"$f":"IF(ISBLANK('8-Process Controls'!U118),\"\",'8-Process Controls'!U118)","v":""}]
[{"$f":"IF(ISBLANK('8-Process Controls'!C119),\"\",'8-Process Controls'!C119)","v":""},{"$f":"IF(ISBLANK('8-Process Controls'!D119),\"\",'8-Process Controls'!D119)","v":""},null,{"$f":"IF(ISBLANK('8-Process Controls'!E119),\"\",'8-Process Controls'!E119)","v":""},{"$f":"IF(ISBLANK('8-Process Controls'!F119),\"\",'8-Process Controls'!F119)","v":""},{"$f":"IF(ISBLANK('8-Process Controls'!G119),\"\",IF(LEFT('8-Process Controls'!G119,1)=\"Y\",\"PT\",\"\"))","v":""},null,{"$f":"IF(ISBLANK('8-Process Controls'!S119),\"\",'8-Process Controls'!S119)","v":""},{"$f":"IF(ISBLANK('8-Process Controls'!T119),\"\",'8-Process Controls'!T119)","v":""},null,null,null,null,null,null,null,null,null,null,null,null,null,{"$f":"IF(ISBLANK('8-Process Controls'!U119),\"\",'8-Process Controls'!U119)","v":""}]
[{"$f":"IF(ISBLANK('8-Process Controls'!C120),\"\",'8-Process Controls'!C120)","v":""},{"$f":"IF(ISBLANK('8-Process Controls'!D120),\"\",'8-Process Controls'!D120)","v":""},null,{"$f":"IF(ISBLANK('8-Process Controls'!E120),\"\",'8-Process Controls'!E120)","v":""},{"$f":"IF(ISBLANK('8-Process Controls'!F120),\"\",'8-Process Controls'!F120)","v":""},{"$f":"IF(ISBLANK('8-Process Controls'!G120),\"\",IF(LEFT('8-Process Controls'!G120,1)=\"Y\",\"PT\",\"\"))","v":""},null,{"$f":"IF(ISBLANK('8-Process Controls'!S120),\"\",'8-Process Controls'!S120)","v":""},{"$f":"IF(ISBLANK('8-Process Controls'!T120),\"\",'8-Process Controls'!T120)","v":""},null,null,null,null,null,null,null,null,null,null,null,null,null,{"$f":"IF(ISBLANK('8-Process Controls'!U120),\"\",'8-Process Controls'!U120)","v":""}]
[{"$f":"IF(ISBLANK('8-Process Controls'!C121),\"\",'8-Process Controls'!C121)","v":""},{"$f":"IF(ISBLANK('8-Process Controls'!D121),\"\",'8-Process Controls'!D121)","v":""},null,{"$f":"IF(ISBLANK('8-Process Controls'!E121),\"\",'8-Process Controls'!E121)","v":""},{"$f":"IF(ISBLANK('8-Process Controls'!F121),\"\",'8-Process Controls'!F121)","v":""},{"$f":"IF(ISBLANK('8-Process Controls'!G121),\"\",IF(LEFT('8-Process Controls'!G121,1)=\"Y\",\"PT\",\"\"))","v":""},null,{"$f":"IF(ISBLANK('8-Process Controls'!S121),\"\",'8-Process Controls'!S121)","v":""},{"$f":"IF(ISBLANK('8-Process Controls'!T121),\"\",'8-Process Controls'!T121)","v":""},null,null,null,null,null,null,null,null,null,null,null,null,null,{"$f":"IF(ISBLANK('8-Process Controls'!U121),\"\",'8-Process Controls'!U121)","v":""}]
[{"$f":"IF(ISBLANK('8-Process Controls'!C122),\"\",'8-Process Controls'!C122)","v":""},{"$f":"IF(ISBLANK('8-Process Controls'!D122),\"\",'8-Process Controls'!D122)","v":""},null,{"$f":"IF(ISBLANK('8-Process Controls'!E122),\"\",'8-Process Controls'!E122)","v":""},{"$f":"IF(ISBLANK('8-Process Controls'!F122),\"\",'8-Process Controls'!F122)","v":""},{"$f":"IF(ISBLANK('8-Process Controls'!G122),\"\",IF(LEFT('8-Process Controls'!G122,1)=\"Y\",\"PT\",\"\"))","v":""},null,{"$f":"IF(ISBLANK('8-Process Controls'!S122),\"\",'8-Process Controls'!S122)","v":""},{"$f":"IF(ISBLANK('8-Process Controls'!T122),\"\",'8-Process Controls'!T122)","v":""},null,null,null,null,null,null,null,null,null,null,null,null,null,{"$f":"IF(ISBLANK('8-Process Controls'!U122),\"\",'8-Process Controls'!U122)","v":""}]
[{"$f":"IF(ISBLANK('8-Process Controls'!C123),\"\",'8-Process Controls'!C123)","v":""},{"$f":"IF(ISBLANK('8-Process Controls'!D123),\"\",'8-Process Controls'!D123)","v":""},null,{"$f":"IF(ISBLANK('8-Process Controls'!E123),\"\",'8-Process Controls'!E123)","v":""},{"$f":"IF(ISBLANK('8-Process Controls'!F123),\"\",'8-Process Controls'!F123)","v":""},{"$f":"IF(ISBLANK('8-Process Controls'!G123),\"\",IF(LEFT('8-Process Controls'!G123,1)=\"Y\",\"PT\",\"\"))","v":""},null,{"$f":"IF(ISBLANK('8-Process Controls'!S123),\"\",'8-Process Controls'!S123)","v":""},{"$f":"IF(ISBLANK('8-Process Controls'!T123),\"\",'8-Process Controls'!T123)","v":""},null,null,null,null,null,null,null,null,null,null,null,null,null,{"$f":"IF(ISBLANK('8-Process Controls'!U123),\"\",'8-Process Controls'!U123)","v":""}]
[{"$f":"IF(ISBLANK('8-Process Controls'!C124),\"\",'8-Process Controls'!C124)","v":""},{"$f":"IF(ISBLANK('8-Process Controls'!D124),\"\",'8-Process Controls'!D124)","v":""},null,{"$f":"IF(ISBLANK('8-Process Controls'!E124),\"\",'8-Process Controls'!E124)","v":""},{"$f":"IF(ISBLANK('8-Process Controls'!F124),\"\",'8-Process Controls'!F124)","v":""},{"$f":"IF(ISBLANK('8-Process Controls'!G124),\"\",IF(LEFT('8-Process Controls'!G124,1)=\"Y\",\"PT\",\"\"))","v":""},null,{"$f":"IF(ISBLANK('8-Process Controls'!S124),\"\",'8-Process Controls'!S124)","v":""},{"$f":"IF(ISBLANK('8-Process Controls'!T124),\"\",'8-Process Controls'!T124)","v":""},null,null,null,null,null,null,null,null,null,null,null,null,null,{"$f":"IF(ISBLANK('8-Process Controls'!U124),\"\",'8-Process Controls'!U124)","v":""}]
[{"$f":"IF(ISBLANK('8-Process Controls'!C125),\"\",'8-Process Controls'!C125)","v":""},{"$f":"IF(ISBLANK('8-Process Controls'!D125),\"\",'8-Process Controls'!D125)","v":""},null,{"$f":"IF(ISBLANK('8-Process Controls'!E125),\"\",'8-Process Controls'!E125)","v":""},{"$f":"IF(ISBLANK('8-Process Controls'!F125),\"\",'8-Process Controls'!F125)","v":""},{"$f":"IF(ISBLANK('8-Process Controls'!G125),\"\",IF(LEFT('8-Process Controls'!G125,1)=\"Y\",\"PT\",\"\"))","v":""},null,{"$f":"IF(ISBLANK('8-Process Controls'!S125),\"\",'8-Process Controls'!S125)","v":""},{"$f":"IF(ISBLANK('8-Process Controls'!T125),\"\",'8-Process Controls'!T125)","v":""},null,null,null,null,null,null,null,null,null,null,null,null,null,{"$f":"IF(ISBLANK('8-Process Controls'!U125),\"\",'8-Process Controls'!U125)","v":""}]
[{"$f":"IF(ISBLANK('8-Process Controls'!C126),\"\",'8-Process Controls'!C126)","v":""},{"$f":"IF(ISBLANK('8-Process Controls'!D126),\"\",'8-Process Controls'!D126)","v":""},null,{"$f":"IF(ISBLANK('8-Process Controls'!E126),\"\",'8-Process Controls'!E126)","v":""},{"$f":"IF(ISBLANK('8-Process Controls'!F126),\"\",'8-Process Controls'!F126)","v":""},{"$f":"IF(ISBLANK('8-Process Controls'!G126),\"\",IF(LEFT('8-Process Controls'!G126,1)=\"Y\",\"PT\",\"\"))","v":""},null,{"$f":"IF(ISBLANK('8-Process Controls'!S126),\"\",'8-Process Controls'!S126)","v":""},{"$f":"IF(ISBLANK('8-Process Controls'!T126),\"\",'8-Process Controls'!T126)","v":""},null,null,null,null,null,null,null,null,null,null,null,null,null,{"$f":"IF(ISBLANK('8-Process Controls'!U126),\"\",'8-Process Controls'!U126)","v":""}]
[{"$f":"IF(ISBLANK('8-Process Controls'!C127),\"\",'8-Process Controls'!C127)","v":""},{"$f":"IF(ISBLANK('8-Process Controls'!D127),\"\",'8-Process Controls'!D127)","v":""},null,{"$f":"IF(ISBLANK('8-Process Controls'!E127),\"\",'8-Process Controls'!E127)","v":""},{"$f":"IF(ISBLANK('8-Process Controls'!F127),\"\",'8-Process Controls'!F127)","v":""},{"$f":"IF(ISBLANK('8-Process Controls'!G127),\"\",IF(LEFT('8-Process Controls'!G127,1)=\"Y\",\"PT\",\"\"))","v":""},null,{"$f":"IF(ISBLANK('8-Process Controls'!S127),\"\",'8-Process Controls'!S127)","v":""},{"$f":"IF(ISBLANK('8-Process Controls'!T127),\"\",'8-Process Controls'!T127)","v":""},null,null,null,null,null,null,null,null,null,null,null,null,null,{"$f":"IF(ISBLANK('8-Process Controls'!U127),\"\",'8-Process Controls'!U127)","v":""}]
[{"$f":"IF(ISBLANK('8-Process Controls'!C128),\"\",'8-Process Controls'!C128)","v":""},{"$f":"IF(ISBLANK('8-Process Controls'!D128),\"\",'8-Process Controls'!D128)","v":""},null,{"$f":"IF(ISBLANK('8-Process Controls'!E128),\"\",'8-Process Controls'!E128)","v":""},{"$f":"IF(ISBLANK('8-Process Controls'!F128),\"\",'8-Process Controls'!F128)","v":""},{"$f":"IF(ISBLANK('8-Process Controls'!G128),\"\",IF(LEFT('8-Process Controls'!G128,1)=\"Y\",\"PT\",\"\"))","v":""},null,{"$f":"IF(ISBLANK('8-Process Controls'!S128),\"\",'8-Process Controls'!S128)","v":""},{"$f":"IF(ISBLANK('8-Process Controls'!T128),\"\",'8-Process Controls'!T128)","v":""},null,null,null,null,null,null,null,null,null,null,null,null,null,{"$f":"IF(ISBLANK('8-Process Controls'!U128),\"\",'8-Process Controls'!U128)","v":""}]
[{"$f":"IF(ISBLANK('8-Process Controls'!C129),\"\",'8-Process Controls'!C129)","v":""},{"$f":"IF(ISBLANK('8-Process Controls'!D129),\"\",'8-Process Controls'!D129)","v":""},null,{"$f":"IF(ISBLANK('8-Process Controls'!E129),\"\",'8-Process Controls'!E129)","v":""},{"$f":"IF(ISBLANK('8-Process Controls'!F129),\"\",'8-Process Controls'!F129)","v":""},{"$f":"IF(ISBLANK('8-Process Controls'!G129),\"\",IF(LEFT('8-Process Controls'!G129,1)=\"Y\",\"PT\",\"\"))","v":""},null,{"$f":"IF(ISBLANK('8-Process Controls'!S129),\"\",'8-Process Controls'!S129)","v":""},{"$f":"IF(ISBLANK('8-Process Controls'!T129),\"\",'8-Process Controls'!T129)","v":""},null,null,null,null,null,null,null,null,null,null,null,null,null,{"$f":"IF(ISBLANK('8-Process Controls'!U129),\"\",'8-Process Controls'!U129)","v":""}]
[{"$f":"IF(ISBLANK('8-Process Controls'!C130),\"\",'8-Process Controls'!C130)","v":""},{"$f":"IF(ISBLANK('8-Process Controls'!D130),\"\",'8-Process Controls'!D130)","v":""},null,{"$f":"IF(ISBLANK('8-Process Controls'!E130),\"\",'8-Process Controls'!E130)","v":""},{"$f":"IF(ISBLANK('8-Process Controls'!F130),\"\",'8-Process Controls'!F130)","v":""},{"$f":"IF(ISBLANK('8-Process Controls'!G130),\"\",IF(LEFT('8-Process Controls'!G130,1)=\"Y\",\"PT\",\"\"))","v":""},null,{"$f":"IF(ISBLANK('8-Process Controls'!S130),\"\",'8-Process Controls'!S130)","v":""},{"$f":"IF(ISBLANK('8-Process Controls'!T130),\"\",'8-Process Controls'!T130)","v":""},null,null,null,null,null,null,null,null,null,null,null,null,null,{"$f":"IF(ISBLANK('8-Process Controls'!U130),\"\",'8-Process Controls'!U130)","v":""}]
[{"$f":"IF(ISBLANK('8-Process Controls'!C131),\"\",'8-Process Controls'!C131)","v":""},{"$f":"IF(ISBLANK('8-Process Controls'!D131),\"\",'8-Process Controls'!D131)","v":""},null,{"$f":"IF(ISBLANK('8-Process Controls'!E131),\"\",'8-Process Controls'!E131)","v":""},{"$f":"IF(ISBLANK('8-Process Controls'!F131),\"\",'8-Process Controls'!F131)","v":""},{"$f":"IF(ISBLANK('8-Process Controls'!G131),\"\",IF(LEFT('8-Process Controls'!G131,1)=\"Y\",\"PT\",\"\"))","v":""},null,{"$f":"IF(ISBLANK('8-Process Controls'!S131),\"\",'8-Process Controls'!S131)","v":""},{"$f":"IF(ISBLANK('8-Process Controls'!T131),\"\",'8-Process Controls'!T131)","v":""},null,null,null,null,null,null,null,null,null,null,null,null,null,{"$f":"IF(ISBLANK('8-Process Controls'!U131),\"\",'8-Process Controls'!U131)","v":""}]
[{"$f":"IF(ISBLANK('8-Process Controls'!C132),\"\",'8-Process Controls'!C132)","v":""},{"$f":"IF(ISBLANK('8-Process Controls'!D132),\"\",'8-Process Controls'!D132)","v":""},null,{"$f":"IF(ISBLANK('8-Process Controls'!E132),\"\",'8-Process Controls'!E132)","v":""},{"$f":"IF(ISBLANK('8-Process Controls'!F132),\"\",'8-Process Controls'!F132)","v":""},{"$f":"IF(ISBLANK('8-Process Controls'!G132),\"\",IF(LEFT('8-Process Controls'!G132,1)=\"Y\",\"PT\",\"\"))","v":""},null,{"$f":"IF(ISBLANK('8-Process Controls'!S132),\"\",'8-Process Controls'!S132)","v":""},{"$f":"IF(ISBLANK('8-Process Controls'!T132),\"\",'8-Process Controls'!T132)","v":""},null,null,null,null,null,null,null,null,null,null,null,null,null,{"$f":"IF(ISBLANK('8-Process Controls'!U132),\"\",'8-Process Controls'!U132)","v":""}]
[{"$f":"IF(ISBLANK('8-Process Controls'!C133),\"\",'8-Process Controls'!C133)","v":""},{"$f":"IF(ISBLANK('8-Process Controls'!D133),\"\",'8-Process Controls'!D133)","v":""},null,{"$f":"IF(ISBLANK('8-Process Controls'!E133),\"\",'8-Process Controls'!E133)","v":""},{"$f":"IF(ISBLANK('8-Process Controls'!F133),\"\",'8-Process Controls'!F133)","v":""},{"$f":"IF(ISBLANK('8-Process Controls'!G133),\"\",IF(LEFT('8-Process Controls'!G133,1)=\"Y\",\"PT\",\"\"))","v":""},null,{"$f":"IF(ISBLANK('8-Process Controls'!S133),\"\",'8-Process Controls'!S133)","v":""},{"$f":"IF(ISBLANK('8-Process Controls'!T133),\"\",'8-Process Controls'!T133)","v":""},null,null,null,null,null,null,null,null,null,null,null,null,null,{"$f":"IF(ISBLANK('8-Process Controls'!U133),\"\",'8-Process Controls'!U133)","v":""}]
[{"$f":"IF(ISBLANK('8-Process Controls'!C134),\"\",'8-Process Controls'!C134)","v":""},{"$f":"IF(ISBLANK('8-Process Controls'!D134),\"\",'8-Process Controls'!D134)","v":""},null,{"$f":"IF(ISBLANK('8-Process Controls'!E134),\"\",'8-Process Controls'!E134)","v":""},{"$f":"IF(ISBLANK('8-Process Controls'!F134),\"\",'8-Process Controls'!F134)","v":""},{"$f":"IF(ISBLANK('8-Process Controls'!G134),\"\",IF(LEFT('8-Process Controls'!G134,1)=\"Y\",\"PT\",\"\"))","v":""},null,{"$f":"IF(ISBLANK('8-Process Controls'!S134),\"\",'8-Process Controls'!S134)","v":""},{"$f":"IF(ISBLANK('8-Process Controls'!T134),\"\",'8-Process Controls'!T134)","v":""},null,null,null,null,null,null,null,null,null,null,null,null,null,{"$f":"IF(ISBLANK('8-Process Controls'!U134),\"\",'8-Process Controls'!U134)","v":""}]
[{"$f":"IF(ISBLANK('8-Process Controls'!C135),\"\",'8-Process Controls'!C135)","v":""},{"$f":"IF(ISBLANK('8-Process Controls'!D135),\"\",'8-Process Controls'!D135)","v":""},null,{"$f":"IF(ISBLANK('8-Process Controls'!E135),\"\",'8-Process Controls'!E135)","v":""},{"$f":"IF(ISBLANK('8-Process Controls'!F135),\"\",'8-Process Controls'!F135)","v":""},{"$f":"IF(ISBLANK('8-Process Controls'!G135),\"\",IF(LEFT('8-Process Controls'!G135,1)=\"Y\",\"PT\",\"\"))","v":""},null,{"$f":"IF(ISBLANK('8-Process Controls'!S135),\"\",'8-Process Controls'!S135)","v":""},{"$f":"IF(ISBLANK('8-Process Controls'!T135),\"\",'8-Process Controls'!T135)","v":""},null,null,null,null,null,null,null,null,null,null,null,null,null,{"$f":"IF(ISBLANK('8-Process Controls'!U135),\"\",'8-Process Controls'!U135)","v":""}]
[{"$f":"IF(ISBLANK('8-Process Controls'!C136),\"\",'8-Process Controls'!C136)","v":""},{"$f":"IF(ISBLANK('8-Process Controls'!D136),\"\",'8-Process Controls'!D136)","v":""},null,{"$f":"IF(ISBLANK('8-Process Controls'!E136),\"\",'8-Process Controls'!E136)","v":""},{"$f":"IF(ISBLANK('8-Process Controls'!F136),\"\",'8-Process Controls'!F136)","v":""},{"$f":"IF(ISBLANK('8-Process Controls'!G136),\"\",IF(LEFT('8-Process Controls'!G136,1)=\"Y\",\"PT\",\"\"))","v":""},null,{"$f":"IF(ISBLANK('8-Process Controls'!S136),\"\",'8-Process Controls'!S136)","v":""},{"$f":"IF(ISBLANK('8-Process Controls'!T136),\"\",'8-Process Controls'!T136)","v":""},null,null,null,null,null,null,null,null,null,null,null,null,null,{"$f":"IF(ISBLANK('8-Process Controls'!U136),\"\",'8-Process Controls'!U136)","v":""}]
[{"$f":"IF(ISBLANK('8-Process Controls'!C137),\"\",'8-Process Controls'!C137)","v":""},{"$f":"IF(ISBLANK('8-Process Controls'!D137),\"\",'8-Process Controls'!D137)","v":""},null,{"$f":"IF(ISBLANK('8-Process Controls'!E137),\"\",'8-Process Controls'!E137)","v":""},{"$f":"IF(ISBLANK('8-Process Controls'!F137),\"\",'8-Process Controls'!F137)","v":""},{"$f":"IF(ISBLANK('8-Process Controls'!G137),\"\",IF(LEFT('8-Process Controls'!G137,1)=\"Y\",\"PT\",\"\"))","v":""},null,{"$f":"IF(ISBLANK('8-Process Controls'!S137),\"\",'8-Process Controls'!S137)","v":""},{"$f":"IF(ISBLANK('8-Process Controls'!T137),\"\",'8-Process Controls'!T137)","v":""},null,null,null,null,null,null,null,null,null,null,null,null,null,{"$f":"IF(ISBLANK('8-Process Controls'!U137),\"\",'8-Process Controls'!U137)","v":""}]
[{"$f":"IF(ISBLANK('8-Process Controls'!C138),\"\",'8-Process Controls'!C138)","v":""},{"$f":"IF(ISBLANK('8-Process Controls'!D138),\"\",'8-Process Controls'!D138)","v":""},null,{"$f":"IF(ISBLANK('8-Process Controls'!E138),\"\",'8-Process Controls'!E138)","v":""},{"$f":"IF(ISBLANK('8-Process Controls'!F138),\"\",'8-Process Controls'!F138)","v":""},{"$f":"IF(ISBLANK('8-Process Controls'!G138),\"\",IF(LEFT('8-Process Controls'!G138,1)=\"Y\",\"PT\",\"\"))","v":""},null,{"$f":"IF(ISBLANK('8-Process Controls'!S138),\"\",'8-Process Controls'!S138)","v":""},{"$f":"IF(ISBLANK('8-Process Controls'!T138),\"\",'8-Process Controls'!T138)","v":""},null,null,null,null,null,null,null,null,null,null,null,null,null,{"$f":"IF(ISBLANK('8-Process Controls'!U138),\"\",'8-Process Controls'!U138)","v":""}]
[{"$f":"IF(ISBLANK('8-Process Controls'!C139),\"\",'8-Process Controls'!C139)","v":""},{"$f":"IF(ISBLANK('8-Process Controls'!D139),\"\",'8-Process Controls'!D139)","v":""},null,{"$f":"IF(ISBLANK('8-Process Controls'!E139),\"\",'8-Process Controls'!E139)","v":""},{"$f":"IF(ISBLANK('8-Process Controls'!F139),\"\",'8-Process Controls'!F139)","v":""},{"$f":"IF(ISBLANK('8-Process Controls'!G139),\"\",IF(LEFT('8-Process Controls'!G139,1)=\"Y\",\"PT\",\"\"))","v":""},null,{"$f":"IF(ISBLANK('8-Process Controls'!S139),\"\",'8-Process Controls'!S139)","v":""},{"$f":"IF(ISBLANK('8-Process Controls'!T139),\"\",'8-Process Controls'!T139)","v":""},null,null,null,null,null,null,null,null,null,null,null,null,null,{"$f":"IF(ISBLANK('8-Process Controls'!U139),\"\",'8-Process Controls'!U139)","v":""}]
[{"$f":"IF(ISBLANK('8-Process Controls'!C140),\"\",'8-Process Controls'!C140)","v":""},{"$f":"IF(ISBLANK('8-Process Controls'!D140),\"\",'8-Process Controls'!D140)","v":""},null,{"$f":"IF(ISBLANK('8-Process Controls'!E140),\"\",'8-Process Controls'!E140)","v":""},{"$f":"IF(ISBLANK('8-Process Controls'!F140),\"\",'8-Process Controls'!F140)","v":""},{"$f":"IF(ISBLANK('8-Process Controls'!G140),\"\",IF(LEFT('8-Process Controls'!G140,1)=\"Y\",\"PT\",\"\"))","v":""},null,{"$f":"IF(ISBLANK('8-Process Controls'!S140),\"\",'8-Process Controls'!S140)","v":""},{"$f":"IF(ISBLANK('8-Process Controls'!T140),\"\",'8-Process Controls'!T140)","v":""},null,null,null,null,null,null,null,null,null,null,null,null,null,{"$f":"IF(ISBLANK('8-Process Controls'!U140),\"\",'8-Process Controls'!U140)","v":""}]
[{"$f":"IF(ISBLANK('8-Process Controls'!C141),\"\",'8-Process Controls'!C141)","v":""},{"$f":"IF(ISBLANK('8-Process Controls'!D141),\"\",'8-Process Controls'!D141)","v":""},null,{"$f":"IF(ISBLANK('8-Process Controls'!E141),\"\",'8-Process Controls'!E141)","v":""},{"$f":"IF(ISBLANK('8-Process Controls'!F141),\"\",'8-Process Controls'!F141)","v":""},{"$f":"IF(ISBLANK('8-Process Controls'!G141),\"\",IF(LEFT('8-Process Controls'!G141,1)=\"Y\",\"PT\",\"\"))","v":""},null,{"$f":"IF(ISBLANK('8-Process Controls'!S141),\"\",'8-Process Controls'!S141)","v":""},{"$f":"IF(ISBLANK('8-Process Controls'!T141),\"\",'8-Process Controls'!T141)","v":""},null,null,null,null,null,null,null,null,null,null,null,null,null,{"$f":"IF(ISBLANK('8-Process Controls'!U141),\"\",'8-Process Controls'!U141)","v":""}]
[{"$f":"IF(ISBLANK('8-Process Controls'!C142),\"\",'8-Process Controls'!C142)","v":""},{"$f":"IF(ISBLANK('8-Process Controls'!D142),\"\",'8-Process Controls'!D142)","v":""},null,{"$f":"IF(ISBLANK('8-Process Controls'!E142),\"\",'8-Process Controls'!E142)","v":""},{"$f":"IF(ISBLANK('8-Process Controls'!F142),\"\",'8-Process Controls'!F142)","v":""},{"$f":"IF(ISBLANK('8-Process Controls'!G142),\"\",IF(LEFT('8-Process Controls'!G142,1)=\"Y\",\"PT\",\"\"))","v":""},null,{"$f":"IF(ISBLANK('8-Process Controls'!S142),\"\",'8-Process Controls'!S142)","v":""},{"$f":"IF(ISBLANK('8-Process Controls'!T142),\"\",'8-Process Controls'!T142)","v":""},null,null,null,null,null,null,null,null,null,null,null,null,null,{"$f":"IF(ISBLANK('8-Process Controls'!U142),\"\",'8-Process Controls'!U142)","v":""}]
[{"$f":"IF(ISBLANK('8-Process Controls'!C143),\"\",'8-Process Controls'!C143)","v":""},{"$f":"IF(ISBLANK('8-Process Controls'!D143),\"\",'8-Process Controls'!D143)","v":""},null,{"$f":"IF(ISBLANK('8-Process Controls'!E143),\"\",'8-Process Controls'!E143)","v":""},{"$f":"IF(ISBLANK('8-Process Controls'!F143),\"\",'8-Process Controls'!F143)","v":""},{"$f":"IF(ISBLANK('8-Process Controls'!G143),\"\",IF(LEFT('8-Process Controls'!G143,1)=\"Y\",\"PT\",\"\"))","v":""},null,{"$f":"IF(ISBLANK('8-Process Controls'!S143),\"\",'8-Process Controls'!S143)","v":""},{"$f":"IF(ISBLANK('8-Process Controls'!T143),\"\",'8-Process Controls'!T143)","v":""},null,null,null,null,null,null,null,null,null,null,null,null,null,{"$f":"IF(ISBLANK('8-Process Controls'!U143),\"\",'8-Process Controls'!U143)","v":""}]
[{"$f":"IF(ISBLANK('8-Process Controls'!C144),\"\",'8-Process Controls'!C144)","v":""},{"$f":"IF(ISBLANK('8-Process Controls'!D144),\"\",'8-Process Controls'!D144)","v":""},null,{"$f":"IF(ISBLANK('8-Process Controls'!E144),\"\",'8-Process Controls'!E144)","v":""},{"$f":"IF(ISBLANK('8-Process Controls'!F144),\"\",'8-Process Controls'!F144)","v":""},{"$f":"IF(ISBLANK('8-Process Controls'!G144),\"\",IF(LEFT('8-Process Controls'!G144,1)=\"Y\",\"PT\",\"\"))","v":""},null,{"$f":"IF(ISBLANK('8-Process Controls'!S144),\"\",'8-Process Controls'!S144)","v":""},{"$f":"IF(ISBLANK('8-Process Controls'!T144),\"\",'8-Process Controls'!T144)","v":""},null,null,null,null,null,null,null,null,null,null,null,null,null,{"$f":"IF(ISBLANK('8-Process Controls'!U144),\"\",'8-Process Controls'!U144)","v":""}]
[{"$f":"IF(ISBLANK('8-Process Controls'!C145),\"\",'8-Process Controls'!C145)","v":""},{"$f":"IF(ISBLANK('8-Process Controls'!D145),\"\",'8-Process Controls'!D145)","v":""},null,{"$f":"IF(ISBLANK('8-Process Controls'!E145),\"\",'8-Process Controls'!E145)","v":""},{"$f":"IF(ISBLANK('8-Process Controls'!F145),\"\",'8-Process Controls'!F145)","v":""},{"$f":"IF(ISBLANK('8-Process Controls'!G145),\"\",IF(LEFT('8-Process Controls'!G145,1)=\"Y\",\"PT\",\"\"))","v":""},null,{"$f":"IF(ISBLANK('8-Process Controls'!S145),\"\",'8-Process Controls'!S145)","v":""},{"$f":"IF(ISBLANK('8-Process Controls'!T145),\"\",'8-Process Controls'!T145)","v":""},null,null,null,null,null,null,null,null,null,null,null,null,null,{"$f":"IF(ISBLANK('8-Process Controls'!U145),\"\",'8-Process Controls'!U145)","v":""}]
[{"$f":"IF(ISBLANK('8-Process Controls'!C146),\"\",'8-Process Controls'!C146)","v":""},{"$f":"IF(ISBLANK('8-Process Controls'!D146),\"\",'8-Process Controls'!D146)","v":""},null,{"$f":"IF(ISBLANK('8-Process Controls'!E146),\"\",'8-Process Controls'!E146)","v":""},{"$f":"IF(ISBLANK('8-Process Controls'!F146),\"\",'8-Process Controls'!F146)","v":""},{"$f":"IF(ISBLANK('8-Process Controls'!G146),\"\",IF(LEFT('8-Process Controls'!G146,1)=\"Y\",\"PT\",\"\"))","v":""},null,{"$f":"IF(ISBLANK('8-Process Controls'!S146),\"\",'8-Process Controls'!S146)","v":""},{"$f":"IF(ISBLANK('8-Process Controls'!T146),\"\",'8-Process Controls'!T146)","v":""},null,null,null,null,null,null,null,null,null,null,null,null,null,{"$f":"IF(ISBLANK('8-Process Controls'!U146),\"\",'8-Process Controls'!U146)","v":""}]
[{"$f":"IF(ISBLANK('8-Process Controls'!C147),\"\",'8-Process Controls'!C147)","v":""},{"$f":"IF(ISBLANK('8-Process Controls'!D147),\"\",'8-Process Controls'!D147)","v":""},null,{"$f":"IF(ISBLANK('8-Process Controls'!E147),\"\",'8-Process Controls'!E147)","v":""},{"$f":"IF(ISBLANK('8-Process Controls'!F147),\"\",'8-Process Controls'!F147)","v":""},{"$f":"IF(ISBLANK('8-Process Controls'!G147),\"\",IF(LEFT('8-Process Controls'!G147,1)=\"Y\",\"PT\",\"\"))","v":""},null,{"$f":"IF(ISBLANK('8-Process Controls'!S147),\"\",'8-Process Controls'!S147)","v":""},{"$f":"IF(ISBLANK('8-Process Controls'!T147),\"\",'8-Process Controls'!T147)","v":""},null,null,null,null,null,null,null,null,null,null,null,null,null,{"$f":"IF(ISBLANK('8-Process Controls'!U147),\"\",'8-Process Controls'!U147)","v":""}]
[{"$f":"IF(ISBLANK('8-Process Controls'!C148),\"\",'8-Process Controls'!C148)","v":""},{"$f":"IF(ISBLANK('8-Process Controls'!D148),\"\",'8-Process Controls'!D148)","v":""},null,{"$f":"IF(ISBLANK('8-Process Controls'!E148),\"\",'8-Process Controls'!E148)","v":""},{"$f":"IF(ISBLANK('8-Process Controls'!F148),\"\",'8-Process Controls'!F148)","v":""},{"$f":"IF(ISBLANK('8-Process Controls'!G148),\"\",IF(LEFT('8-Process Controls'!G148,1)=\"Y\",\"PT\",\"\"))","v":""},null,{"$f":"IF(ISBLANK('8-Process Controls'!S148),\"\",'8-Process Controls'!S148)","v":""},{"$f":"IF(ISBLANK('8-Process Controls'!T148),\"\",'8-Process Controls'!T148)","v":""},null,null,null,null,null,null,null,null,null,null,null,null,null,{"$f":"IF(ISBLANK('8-Process Controls'!U148),\"\",'8-Process Controls'!U148)","v":""}]
[{"$f":"IF(ISBLANK('8-Process Controls'!C149),\"\",'8-Process Controls'!C149)","v":""},{"$f":"IF(ISBLANK('8-Process Controls'!D149),\"\",'8-Process Controls'!D149)","v":""},null,{"$f":"IF(ISBLANK('8-Process Controls'!E149),\"\",'8-Process Controls'!E149)","v":""},{"$f":"IF(ISBLANK('8-Process Controls'!F149),\"\",'8-Process Controls'!F149)","v":""},{"$f":"IF(ISBLANK('8-Process Controls'!G149),\"\",IF(LEFT('8-Process Controls'!G149,1)=\"Y\",\"PT\",\"\"))","v":""},null,{"$f":"IF(ISBLANK('8-Process Controls'!S149),\"\",'8-Process Controls'!S149)","v":""},{"$f":"IF(ISBLANK('8-Process Controls'!T149),\"\",'8-Process Controls'!T149)","v":""},null,null,null,null,null,null,null,null,null,null,null,null,null,{"$f":"IF(ISBLANK('8-Process Controls'!U149),\"\",'8-Process Controls'!U149)","v":""}]
[{"$f":"IF(ISBLANK('8-Process Controls'!C150),\"\",'8-Process Controls'!C150)","v":""},{"$f":"IF(ISBLANK('8-Process Controls'!D150),\"\",'8-Process Controls'!D150)","v":""},null,{"$f":"IF(ISBLANK('8-Process Controls'!E150),\"\",'8-Process Controls'!E150)","v":""},{"$f":"IF(ISBLANK('8-Process Controls'!F150),\"\",'8-Process Controls'!F150)","v":""},{"$f":"IF(ISBLANK('8-Process Controls'!G150),\"\",IF(LEFT('8-Process Controls'!G150,1)=\"Y\",\"PT\",\"\"))","v":""},null,{"$f":"IF(ISBLANK('8-Process Controls'!S150),\"\",'8-Process Controls'!S150)","v":""},{"$f":"IF(ISBLANK('8-Process Controls'!T150),\"\",'8-Process Controls'!T150)","v":""},null,null,null,null,null,null,null,null,null,null,null,null,null,{"$f":"IF(ISBLANK('8-Process Controls'!U150),\"\",'8-Process Controls'!U150)","v":""}]
[{"$f":"IF(ISBLANK('8-Process Controls'!C151),\"\",'8-Process Controls'!C151)","v":""},{"$f":"IF(ISBLANK('8-Process Controls'!D151),\"\",'8-Process Controls'!D151)","v":""},null,{"$f":"IF(ISBLANK('8-Process Controls'!E151),\"\",'8-Process Controls'!E151)","v":""},{"$f":"IF(ISBLANK('8-Process Controls'!F151),\"\",'8-Process Controls'!F151)","v":""},{"$f":"IF(ISBLANK('8-Process Controls'!G151),\"\",IF(LEFT('8-Process Controls'!G151,1)=\"Y\",\"PT\",\"\"))","v":""},null,{"$f":"IF(ISBLANK('8-Process Controls'!S151),\"\",'8-Process Controls'!S151)","v":""},{"$f":"IF(ISBLANK('8-Process Controls'!T151),\"\",'8-Process Controls'!T151)","v":""},null,null,null,null,null,null,null,null,null,null,null,null,null,{"$f":"IF(ISBLANK('8-Process Controls'!U151),\"\",'8-Process Controls'!U151)","v":""}]
[{"$f":"IF(ISBLANK('8-Process Controls'!C152),\"\",'8-Process Controls'!C152)","v":""},{"$f":"IF(ISBLANK('8-Process Controls'!D152),\"\",'8-Process Controls'!D152)","v":""},null,{"$f":"IF(ISBLANK('8-Process Controls'!E152),\"\",'8-Process Controls'!E152)","v":""},{"$f":"IF(ISBLANK('8-Process Controls'!F152),\"\",'8-Process Controls'!F152)","v":""},{"$f":"IF(ISBLANK('8-Process Controls'!G152),\"\",IF(LEFT('8-Process Controls'!G152,1)=\"Y\",\"PT\",\"\"))","v":""},null,{"$f":"IF(ISBLANK('8-Process Controls'!S152),\"\",'8-Process Controls'!S152)","v":""},{"$f":"IF(ISBLANK('8-Process Controls'!T152),\"\",'8-Process Controls'!T152)","v":""},null,null,null,null,null,null,null,null,null,null,null,null,null,{"$f":"IF(ISBLANK('8-Process Controls'!U152),\"\",'8-Process Controls'!U152)","v":""}]
[{"$f":"IF(ISBLANK('8-Process Controls'!C153),\"\",'8-Process Controls'!C153)","v":""},{"$f":"IF(ISBLANK('8-Process Controls'!D153),\"\",'8-Process Controls'!D153)","v":""},null,{"$f":"IF(ISBLANK('8-Process Controls'!E153),\"\",'8-Process Controls'!E153)","v":""},{"$f":"IF(ISBLANK('8-Process Controls'!F153),\"\",'8-Process Controls'!F153)","v":""},{"$f":"IF(ISBLANK('8-Process Controls'!G153),\"\",IF(LEFT('8-Process Controls'!G153,1)=\"Y\",\"PT\",\"\"))","v":""},null,{"$f":"IF(ISBLANK('8-Process Controls'!S153),\"\",'8-Process Controls'!S153)","v":""},{"$f":"IF(ISBLANK('8-Process Controls'!T153),\"\",'8-Process Controls'!T153)","v":""},null,null,null,null,null,null,null,null,null,null,null,null,null,{"$f":"IF(ISBLANK('8-Process Controls'!U153),\"\",'8-Process Controls'!U153)","v":""}]
[{"$f":"IF(ISBLANK('8-Process Controls'!C154),\"\",'8-Process Controls'!C154)","v":""},{"$f":"IF(ISBLANK('8-Process Controls'!D154),\"\",'8-Process Controls'!D154)","v":""},null,{"$f":"IF(ISBLANK('8-Process Controls'!E154),\"\",'8-Process Controls'!E154)","v":""},{"$f":"IF(ISBLANK('8-Process Controls'!F154),\"\",'8-Process Controls'!F154)","v":""},{"$f":"IF(ISBLANK('8-Process Controls'!G154),\"\",IF(LEFT('8-Process Controls'!G154,1)=\"Y\",\"PT\",\"\"))","v":""},null,{"$f":"IF(ISBLANK('8-Process Controls'!S154),\"\",'8-Process Controls'!S154)","v":""},{"$f":"IF(ISBLANK('8-Process Controls'!T154),\"\",'8-Process Controls'!T154)","v":""},null,null,null,null,null,null,null,null,null,null,null,null,null,{"$f":"IF(ISBLANK('8-Process Controls'!U154),\"\",'8-Process Controls'!U154)","v":""}]
[{"$f":"IF(ISBLANK('8-Process Controls'!C155),\"\",'8-Process Controls'!C155)","v":""},{"$f":"IF(ISBLANK('8-Process Controls'!D155),\"\",'8-Process Controls'!D155)","v":""},null,{"$f":"IF(ISBLANK('8-Process Controls'!E155),\"\",'8-Process Controls'!E155)","v":""},{"$f":"IF(ISBLANK('8-Process Controls'!F155),\"\",'8-Process Controls'!F155)","v":""},{"$f":"IF(ISBLANK('8-Process Controls'!G155),\"\",IF(LEFT('8-Process Controls'!G155,1)=\"Y\",\"PT\",\"\"))","v":""},null,{"$f":"IF(ISBLANK('8-Process Controls'!S155),\"\",'8-Process Controls'!S155)","v":""},{"$f":"IF(ISBLANK('8-Process Controls'!T155),\"\",'8-Process Controls'!T155)","v":""},null,null,null,null,null,null,null,null,null,null,null,null,null,{"$f":"IF(ISBLANK('8-Process Controls'!U155),\"\",'8-Process Controls'!U155)","v":""}]
[{"$f":"IF(ISBLANK('8-Process Controls'!C156),\"\",'8-Process Controls'!C156)","v":""},{"$f":"IF(ISBLANK('8-Process Controls'!D156),\"\",'8-Process Controls'!D156)","v":""},null,{"$f":"IF(ISBLANK('8-Process Controls'!E156),\"\",'8-Process Controls'!E156)","v":""},{"$f":"IF(ISBLANK('8-Process Controls'!F156),\"\",'8-Process Controls'!F156)","v":""},{"$f":"IF(ISBLANK('8-Process Controls'!G156),\"\",IF(LEFT('8-Process Controls'!G156,1)=\"Y\",\"PT\",\"\"))","v":""},null,{"$f":"IF(ISBLANK('8-Process Controls'!S156),\"\",'8-Process Controls'!S156)","v":""},{"$f":"IF(ISBLANK('8-Process Controls'!T156),\"\",'8-Process Controls'!T156)","v":""},null,null,null,null,null,null,null,null,null,null,null,null,null,{"$f":"IF(ISBLANK('8-Process Controls'!U156),\"\",'8-Process Controls'!U156)","v":""}]
[{"$f":"IF(ISBLANK('8-Process Controls'!C157),\"\",'8-Process Controls'!C157)","v":""},{"$f":"IF(ISBLANK('8-Process Controls'!D157),\"\",'8-Process Controls'!D157)","v":""},null,{"$f":"IF(ISBLANK('8-Process Controls'!E157),\"\",'8-Process Controls'!E157)","v":""},{"$f":"IF(ISBLANK('8-Process Controls'!F157),\"\",'8-Process Controls'!F157)","v":""},{"$f":"IF(ISBLANK('8-Process Controls'!G157),\"\",IF(LEFT('8-Process Controls'!G157,1)=\"Y\",\"PT\",\"\"))","v":""},null,{"$f":"IF(ISBLANK('8-Process Controls'!S157),\"\",'8-Process Controls'!S157)","v":""},{"$f":"IF(ISBLANK('8-Process Controls'!T157),\"\",'8-Process Controls'!T157)","v":""},null,null,null,null,null,null,null,null,null,null,null,null,null,{"$f":"IF(ISBLANK('8-Process Controls'!U157),\"\",'8-Process Controls'!U157)","v":""}]
[{"$f":"IF(ISBLANK('8-Process Controls'!C158),\"\",'8-Process Controls'!C158)","v":""},{"$f":"IF(ISBLANK('8-Process Controls'!D158),\"\",'8-Process Controls'!D158)","v":""},null,{"$f":"IF(ISBLANK('8-Process Controls'!E158),\"\",'8-Process Controls'!E158)","v":""},{"$f":"IF(ISBLANK('8-Process Controls'!F158),\"\",'8-Process Controls'!F158)","v":""},{"$f":"IF(ISBLANK('8-Process Controls'!G158),\"\",IF(LEFT('8-Process Controls'!G158,1)=\"Y\",\"PT\",\"\"))","v":""},null,{"$f":"IF(ISBLANK('8-Process Controls'!S158),\"\",'8-Process Controls'!S158)","v":""},{"$f":"IF(ISBLANK('8-Process Controls'!T158),\"\",'8-Process Controls'!T158)","v":""},null,null,null,null,null,null,null,null,null,null,null,null,null,{"$f":"IF(ISBLANK('8-Process Controls'!U158),\"\",'8-Process Controls'!U158)","v":""}]
[{"$f":"IF(ISBLANK('8-Process Controls'!C159),\"\",'8-Process Controls'!C159)","v":""},{"$f":"IF(ISBLANK('8-Process Controls'!D159),\"\",'8-Process Controls'!D159)","v":""},null,{"$f":"IF(ISBLANK('8-Process Controls'!E159),\"\",'8-Process Controls'!E159)","v":""},{"$f":"IF(ISBLANK('8-Process Controls'!F159),\"\",'8-Process Controls'!F159)","v":""},{"$f":"IF(ISBLANK('8-Process Controls'!G159),\"\",IF(LEFT('8-Process Controls'!G159,1)=\"Y\",\"PT\",\"\"))","v":""},null,{"$f":"IF(ISBLANK('8-Process Controls'!S159),\"\",'8-Process Controls'!S159)","v":""},{"$f":"IF(ISBLANK('8-Process Controls'!T159),\"\",'8-Process Controls'!T159)","v":""},null,null,null,null,null,null,null,null,null,null,null,null,null,{"$f":"IF(ISBLANK('8-Process Controls'!U159),\"\",'8-Process Controls'!U159)","v":""}]
[{"$f":"IF(ISBLANK('8-Process Controls'!C160),\"\",'8-Process Controls'!C160)","v":""},{"$f":"IF(ISBLANK('8-Process Controls'!D160),\"\",'8-Process Controls'!D160)","v":""},null,{"$f":"IF(ISBLANK('8-Process Controls'!E160),\"\",'8-Process Controls'!E160)","v":""},{"$f":"IF(ISBLANK('8-Process Controls'!F160),\"\",'8-Process Controls'!F160)","v":""},{"$f":"IF(ISBLANK('8-Process Controls'!G160),\"\",IF(LEFT('8-Process Controls'!G160,1)=\"Y\",\"PT\",\"\"))","v":""},null,{"$f":"IF(ISBLANK('8-Process Controls'!S160),\"\",'8-Process Controls'!S160)","v":""},{"$f":"IF(ISBLANK('8-Process Controls'!T160),\"\",'8-Process Controls'!T160)","v":""},null,null,null,null,null,null,null,null,null,null,null,null,null,{"$f":"IF(ISBLANK('8-Process Controls'!U160),\"\",'8-Process Controls'!U160)","v":""}]
[{"$f":"IF(ISBLANK('8-Process Controls'!C161),\"\",'8-Process Controls'!C161)","v":""},{"$f":"IF(ISBLANK('8-Process Controls'!D161),\"\",'8-Process Controls'!D161)","v":""},null,{"$f":"IF(ISBLANK('8-Process Controls'!E161),\"\",'8-Process Controls'!E161)","v":""},{"$f":"IF(ISBLANK('8-Process Controls'!F161),\"\",'8-Process Controls'!F161)","v":""},{"$f":"IF(ISBLANK('8-Process Controls'!G161),\"\",IF(LEFT('8-Process Controls'!G161,1)=\"Y\",\"PT\",\"\"))","v":""},null,{"$f":"IF(ISBLANK('8-Process Controls'!S161),\"\",'8-Process Controls'!S161)","v":""},{"$f":"IF(ISBLANK('8-Process Controls'!T161),\"\",'8-Process Controls'!T161)","v":""},null,null,null,null,null,null,null,null,null,null,null,null,null,{"$f":"IF(ISBLANK('8-Process Controls'!U161),\"\",'8-Process Controls'!U161)","v":""}]
[{"$f":"IF(ISBLANK('8-Process Controls'!C162),\"\",'8-Process Controls'!C162)","v":""},{"$f":"IF(ISBLANK('8-Process Controls'!D162),\"\",'8-Process Controls'!D162)","v":""},null,{"$f":"IF(ISBLANK('8-Process Controls'!E162),\"\",'8-Process Controls'!E162)","v":""},{"$f":"IF(ISBLANK('8-Process Controls'!F162),\"\",'8-Process Controls'!F162)","v":""},{"$f":"IF(ISBLANK('8-Process Controls'!G162),\"\",IF(LEFT('8-Process Controls'!G162,1)=\"Y\",\"PT\",\"\"))","v":""},null,{"$f":"IF(ISBLANK('8-Process Controls'!S162),\"\",'8-Process Controls'!S162)","v":""},{"$f":"IF(ISBLANK('8-Process Controls'!T162),\"\",'8-Process Controls'!T162)","v":""},null,null,null,null,null,null,null,null,null,null,null,null,null,{"$f":"IF(ISBLANK('8-Process Controls'!U162),\"\",'8-Process Controls'!U162)","v":""}]
[{"$f":"IF(ISBLANK('8-Process Controls'!C163),\"\",'8-Process Controls'!C163)","v":""},{"$f":"IF(ISBLANK('8-Process Controls'!D163),\"\",'8-Process Controls'!D163)","v":""},null,{"$f":"IF(ISBLANK('8-Process Controls'!E163),\"\",'8-Process Controls'!E163)","v":""},{"$f":"IF(ISBLANK('8-Process Controls'!F163),\"\",'8-Process Controls'!F163)","v":""},{"$f":"IF(ISBLANK('8-Process Controls'!G163),\"\",IF(LEFT('8-Process Controls'!G163,1)=\"Y\",\"PT\",\"\"))","v":""},null,{"$f":"IF(ISBLANK('8-Process Controls'!S163),\"\",'8-Process Controls'!S163)","v":""},{"$f":"IF(ISBLANK('8-Process Controls'!T163),\"\",'8-Process Controls'!T163)","v":""},null,null,null,null,null,null,null,null,null,null,null,null,null,{"$f":"IF(ISBLANK('8-Process Controls'!U163),\"\",'8-Process Controls'!U163)","v":""}]
[{"$f":"IF(ISBLANK('8-Process Controls'!C164),\"\",'8-Process Controls'!C164)","v":""},{"$f":"IF(ISBLANK('8-Process Controls'!D164),\"\",'8-Process Controls'!D164)","v":""},null,{"$f":"IF(ISBLANK('8-Process Controls'!E164),\"\",'8-Process Controls'!E164)","v":""},{"$f":"IF(ISBLANK('8-Process Controls'!F164),\"\",'8-Process Controls'!F164)","v":""},{"$f":"IF(ISBLANK('8-Process Controls'!G164),\"\",IF(LEFT('8-Process Controls'!G164,1)=\"Y\",\"PT\",\"\"))","v":""},null,{"$f":"IF(ISBLANK('8-Process Controls'!S164),\"\",'8-Process Controls'!S164)","v":""},{"$f":"IF(ISBLANK('8-Process Controls'!T164),\"\",'8-Process Controls'!T164)","v":""},null,null,null,null,null,null,null,null,null,null,null,null,null,{"$f":"IF(ISBLANK('8-Process Controls'!U164),\"\",'8-Process Controls'!U164)","v":""}]
[{"$f":"IF(ISBLANK('8-Process Controls'!C165),\"\",'8-Process Controls'!C165)","v":""},{"$f":"IF(ISBLANK('8-Process Controls'!D165),\"\",'8-Process Controls'!D165)","v":""},null,{"$f":"IF(ISBLANK('8-Process Controls'!E165),\"\",'8-Process Controls'!E165)","v":""},{"$f":"IF(ISBLANK('8-Process Controls'!F165),\"\",'8-Process Controls'!F165)","v":""},{"$f":"IF(ISBLANK('8-Process Controls'!G165),\"\",IF(LEFT('8-Process Controls'!G165,1)=\"Y\",\"PT\",\"\"))","v":""},null,{"$f":"IF(ISBLANK('8-Process Controls'!S165),\"\",'8-Process Controls'!S165)","v":""},{"$f":"IF(ISBLANK('8-Process Controls'!T165),\"\",'8-Process Controls'!T165)","v":""},null,null,null,null,null,null,null,null,null,null,null,null,null,{"$f":"IF(ISBLANK('8-Process Controls'!U165),\"\",'8-Process Controls'!U165)","v":""}]
[{"$f":"IF(ISBLANK('8-Process Controls'!C166),\"\",'8-Process Controls'!C166)","v":""},{"$f":"IF(ISBLANK('8-Process Controls'!D166),\"\",'8-Process Controls'!D166)","v":""},null,{"$f":"IF(ISBLANK('8-Process Controls'!E166),\"\",'8-Process Controls'!E166)","v":""},{"$f":"IF(ISBLANK('8-Process Controls'!F166),\"\",'8-Process Controls'!F166)","v":""},{"$f":"IF(ISBLANK('8-Process Controls'!G166),\"\",IF(LEFT('8-Process Controls'!G166,1)=\"Y\",\"PT\",\"\"))","v":""},null,{"$f":"IF(ISBLANK('8-Process Controls'!S166),\"\",'8-Process Controls'!S166)","v":""},{"$f":"IF(ISBLANK('8-Process Controls'!T166),\"\",'8-Process Controls'!T166)","v":""},null,null,null,null,null,null,null,null,null,null,null,null,null,{"$f":"IF(ISBLANK('8-Process Controls'!U166),\"\",'8-Process Controls'!U166)","v":""}]
[{"$f":"IF(ISBLANK('8-Process Controls'!C167),\"\",'8-Process Controls'!C167)","v":""},{"$f":"IF(ISBLANK('8-Process Controls'!D167),\"\",'8-Process Controls'!D167)","v":""},null,{"$f":"IF(ISBLANK('8-Process Controls'!E167),\"\",'8-Process Controls'!E167)","v":""},{"$f":"IF(ISBLANK('8-Process Controls'!F167),\"\",'8-Process Controls'!F167)","v":""},{"$f":"IF(ISBLANK('8-Process Controls'!G167),\"\",IF(LEFT('8-Process Controls'!G167,1)=\"Y\",\"PT\",\"\"))","v":""},null,{"$f":"IF(ISBLANK('8-Process Controls'!S167),\"\",'8-Process Controls'!S167)","v":""},{"$f":"IF(ISBLANK('8-Process Controls'!T167),\"\",'8-Process Controls'!T167)","v":""},null,null,null,null,null,null,null,null,null,null,null,null,null,{"$f":"IF(ISBLANK('8-Process Controls'!U167),\"\",'8-Process Controls'!U167)","v":""}]
[{"$f":"IF(ISBLANK('8-Process Controls'!C168),\"\",'8-Process Controls'!C168)","v":""},{"$f":"IF(ISBLANK('8-Process Controls'!D168),\"\",'8-Process Controls'!D168)","v":""},null,{"$f":"IF(ISBLANK('8-Process Controls'!E168),\"\",'8-Process Controls'!E168)","v":""},{"$f":"IF(ISBLANK('8-Process Controls'!F168),\"\",'8-Process Controls'!F168)","v":""},{"$f":"IF(ISBLANK('8-Process Controls'!G168),\"\",IF(LEFT('8-Process Controls'!G168,1)=\"Y\",\"PT\",\"\"))","v":""},null,{"$f":"IF(ISBLANK('8-Process Controls'!S168),\"\",'8-Process Controls'!S168)","v":""},{"$f":"IF(ISBLANK('8-Process Controls'!T168),\"\",'8-Process Controls'!T168)","v":""},null,null,null,null,null,null,null,null,null,null,null,null,null,{"$f":"IF(ISBLANK('8-Process Controls'!U168),\"\",'8-Process Controls'!U168)","v":""}]
[{"$f":"IF(ISBLANK('8-Process Controls'!C169),\"\",'8-Process Controls'!C169)","v":""},{"$f":"IF(ISBLANK('8-Process Controls'!D169),\"\",'8-Process Controls'!D169)","v":""},null,{"$f":"IF(ISBLANK('8-Process Controls'!E169),\"\",'8-Process Controls'!E169)","v":""},{"$f":"IF(ISBLANK('8-Process Controls'!F169),\"\",'8-Process Controls'!F169)","v":""},{"$f":"IF(ISBLANK('8-Process Controls'!G169),\"\",IF(LEFT('8-Process Controls'!G169,1)=\"Y\",\"PT\",\"\"))","v":""},null,{"$f":"IF(ISBLANK('8-Process Controls'!S169),\"\",'8-Process Controls'!S169)","v":""},{"$f":"IF(ISBLANK('8-Process Controls'!T169),\"\",'8-Process Controls'!T169)","v":""},null,null,null,null,null,null,null,null,null,null,null,null,null,{"$f":"IF(ISBLANK('8-Process Controls'!U169),\"\",'8-Process Controls'!U169)","v":""}]
[{"$f":"IF(ISBLANK('8-Process Controls'!C170),\"\",'8-Process Controls'!C170)","v":""},{"$f":"IF(ISBLANK('8-Process Controls'!D170),\"\",'8-Process Controls'!D170)","v":""},null,{"$f":"IF(ISBLANK('8-Process Controls'!E170),\"\",'8-Process Controls'!E170)","v":""},{"$f":"IF(ISBLANK('8-Process Controls'!F170),\"\",'8-Process Controls'!F170)","v":""},{"$f":"IF(ISBLANK('8-Process Controls'!G170),\"\",IF(LEFT('8-Process Controls'!G170,1)=\"Y\",\"PT\",\"\"))","v":""},null,{"$f":"IF(ISBLANK('8-Process Controls'!S170),\"\",'8-Process Controls'!S170)","v":""},{"$f":"IF(ISBLANK('8-Process Controls'!T170),\"\",'8-Process Controls'!T170)","v":""},null,null,null,null,null,null,null,null,null,null,null,null,null,{"$f":"IF(ISBLANK('8-Process Controls'!U170),\"\",'8-Process Controls'!U170)","v":""}]
[{"$f":"IF(ISBLANK('8-Process Controls'!C171),\"\",'8-Process Controls'!C171)","v":""},{"$f":"IF(ISBLANK('8-Process Controls'!D171),\"\",'8-Process Controls'!D171)","v":""},null,{"$f":"IF(ISBLANK('8-Process Controls'!E171),\"\",'8-Process Controls'!E171)","v":""},{"$f":"IF(ISBLANK('8-Process Controls'!F171),\"\",'8-Process Controls'!F171)","v":""},{"$f":"IF(ISBLANK('8-Process Controls'!G171),\"\",IF(LEFT('8-Process Controls'!G171,1)=\"Y\",\"PT\",\"\"))","v":""},null,{"$f":"IF(ISBLANK('8-Process Controls'!S171),\"\",'8-Process Controls'!S171)","v":""},{"$f":"IF(ISBLANK('8-Process Controls'!T171),\"\",'8-Process Controls'!T171)","v":""},null,null,null,null,null,null,null,null,null,null,null,null,null,{"$f":"IF(ISBLANK('8-Process Controls'!U171),\"\",'8-Process Controls'!U171)","v":""}]
[{"$f":"IF(ISBLANK('8-Process Controls'!C172),\"\",'8-Process Controls'!C172)","v":""},{"$f":"IF(ISBLANK('8-Process Controls'!D172),\"\",'8-Process Controls'!D172)","v":""},null,{"$f":"IF(ISBLANK('8-Process Controls'!E172),\"\",'8-Process Controls'!E172)","v":""},{"$f":"IF(ISBLANK('8-Process Controls'!F172),\"\",'8-Process Controls'!F172)","v":""},{"$f":"IF(ISBLANK('8-Process Controls'!G172),\"\",IF(LEFT('8-Process Controls'!G172,1)=\"Y\",\"PT\",\"\"))","v":""},null,{"$f":"IF(ISBLANK('8-Process Controls'!S172),\"\",'8-Process Controls'!S172)","v":""},{"$f":"IF(ISBLANK('8-Process Controls'!T172),\"\",'8-Process Controls'!T172)","v":""},null,null,null,null,null,null,null,null,null,null,null,null,null,{"$f":"IF(ISBLANK('8-Process Controls'!U172),\"\",'8-Process Controls'!U172)","v":""}]
[{"$f":"IF(ISBLANK('8-Process Controls'!C173),\"\",'8-Process Controls'!C173)","v":""},{"$f":"IF(ISBLANK('8-Process Controls'!D173),\"\",'8-Process Controls'!D173)","v":""},null,{"$f":"IF(ISBLANK('8-Process Controls'!E173),\"\",'8-Process Controls'!E173)","v":""},{"$f":"IF(ISBLANK('8-Process Controls'!F173),\"\",'8-Process Controls'!F173)","v":""},{"$f":"IF(ISBLANK('8-Process Controls'!G173),\"\",IF(LEFT('8-Process Controls'!G173,1)=\"Y\",\"PT\",\"\"))","v":""},null,{"$f":"IF(ISBLANK('8-Process Controls'!S173),\"\",'8-Process Controls'!S173)","v":""},{"$f":"IF(ISBLANK('8-Process Controls'!T173),\"\",'8-Process Controls'!T173)","v":""},null,null,null,null,null,null,null,null,null,null,null,null,null,{"$f":"IF(ISBLANK('8-Process Controls'!U173),\"\",'8-Process Controls'!U173)","v":""}]
[{"$f":"IF(ISBLANK('8-Process Controls'!C174),\"\",'8-Process Controls'!C174)","v":""},{"$f":"IF(ISBLANK('8-Process Controls'!D174),\"\",'8-Process Controls'!D174)","v":""},null,{"$f":"IF(ISBLANK('8-Process Controls'!E174),\"\",'8-Process Controls'!E174)","v":""},{"$f":"IF(ISBLANK('8-Process Controls'!F174),\"\",'8-Process Controls'!F174)","v":""},{"$f":"IF(ISBLANK('8-Process Controls'!G174),\"\",IF(LEFT('8-Process Controls'!G174,1)=\"Y\",\"PT\",\"\"))","v":""},null,{"$f":"IF(ISBLANK('8-Process Controls'!S174),\"\",'8-Process Controls'!S174)","v":""},{"$f":"IF(ISBLANK('8-Process Controls'!T174),\"\",'8-Process Controls'!T174)","v":""},null,null,null,null,null,null,null,null,null,null,null,null,null,{"$f":"IF(ISBLANK('8-Process Controls'!U174),\"\",'8-Process Controls'!U174)","v":""}]
[{"$f":"IF(ISBLANK('8-Process Controls'!C175),\"\",'8-Process Controls'!C175)","v":""},{"$f":"IF(ISBLANK('8-Process Controls'!D175),\"\",'8-Process Controls'!D175)","v":""},null,{"$f":"IF(ISBLANK('8-Process Controls'!E175),\"\",'8-Process Controls'!E175)","v":""},{"$f":"IF(ISBLANK('8-Process Controls'!F175),\"\",'8-Process Controls'!F175)","v":""},{"$f":"IF(ISBLANK('8-Process Controls'!G175),\"\",IF(LEFT('8-Process Controls'!G175,1)=\"Y\",\"PT\",\"\"))","v":""},null,{"$f":"IF(ISBLANK('8-Process Controls'!S175),\"\",'8-Process Controls'!S175)","v":""},{"$f":"IF(ISBLANK('8-Process Controls'!T175),\"\",'8-Process Controls'!T175)","v":""},null,null,null,null,null,null,null,null,null,null,null,null,null,{"$f":"IF(ISBLANK('8-Process Controls'!U175),\"\",'8-Process Controls'!U175)","v":""}]
[{"$f":"IF(ISBLANK('8-Process Controls'!C176),\"\",'8-Process Controls'!C176)","v":""},{"$f":"IF(ISBLANK('8-Process Controls'!D176),\"\",'8-Process Controls'!D176)","v":""},null,{"$f":"IF(ISBLANK('8-Process Controls'!E176),\"\",'8-Process Controls'!E176)","v":""},{"$f":"IF(ISBLANK('8-Process Controls'!F176),\"\",'8-Process Controls'!F176)","v":""},{"$f":"IF(ISBLANK('8-Process Controls'!G176),\"\",IF(LEFT('8-Process Controls'!G176,1)=\"Y\",\"PT\",\"\"))","v":""},null,{"$f":"IF(ISBLANK('8-Process Controls'!S176),\"\",'8-Process Controls'!S176)","v":""},{"$f":"IF(ISBLANK('8-Process Controls'!T176),\"\",'8-Process Controls'!T176)","v":""},null,null,null,null,null,null,null,null,null,null,null,null,null,{"$f":"IF(ISBLANK('8-Process Controls'!U176),\"\",'8-Process Controls'!U176)","v":""}]
[{"$f":"IF(ISBLANK('8-Process Controls'!C177),\"\",'8-Process Controls'!C177)","v":""},{"$f":"IF(ISBLANK('8-Process Controls'!D177),\"\",'8-Process Controls'!D177)","v":""},null,{"$f":"IF(ISBLANK('8-Process Controls'!E177),\"\",'8-Process Controls'!E177)","v":""},{"$f":"IF(ISBLANK('8-Process Controls'!F177),\"\",'8-Process Controls'!F177)","v":""},{"$f":"IF(ISBLANK('8-Process Controls'!G177),\"\",IF(LEFT('8-Process Controls'!G177,1)=\"Y\",\"PT\",\"\"))","v":""},null,{"$f":"IF(ISBLANK('8-Process Controls'!S177),\"\",'8-Process Controls'!S177)","v":""},{"$f":"IF(ISBLANK('8-Process Controls'!T177),\"\",'8-Process Controls'!T177)","v":""},null,null,null,null,null,null,null,null,null,null,null,null,null,{"$f":"IF(ISBLANK('8-Process Controls'!U177),\"\",'8-Process Controls'!U177)","v":""}]
[{"$f":"IF(ISBLANK('8-Process Controls'!C178),\"\",'8-Process Controls'!C178)","v":""},{"$f":"IF(ISBLANK('8-Process Controls'!D178),\"\",'8-Process Controls'!D178)","v":""},null,{"$f":"IF(ISBLANK('8-Process Controls'!E178),\"\",'8-Process Controls'!E178)","v":""},{"$f":"IF(ISBLANK('8-Process Controls'!F178),\"\",'8-Process Controls'!F178)","v":""},{"$f":"IF(ISBLANK('8-Process Controls'!G178),\"\",IF(LEFT('8-Process Controls'!G178,1)=\"Y\",\"PT\",\"\"))","v":""},null,{"$f":"IF(ISBLANK('8-Process Controls'!S178),\"\",'8-Process Controls'!S178)","v":""},{"$f":"IF(ISBLANK('8-Process Controls'!T178),\"\",'8-Process Controls'!T178)","v":""},null,null,null,null,null,null,null,null,null,null,null,null,null,{"$f":"IF(ISBLANK('8-Process Controls'!U178),\"\",'8-Process Controls'!U178)","v":""}]
[{"$f":"IF(ISBLANK('8-Process Controls'!C179),\"\",'8-Process Controls'!C179)","v":""},{"$f":"IF(ISBLANK('8-Process Controls'!D179),\"\",'8-Process Controls'!D179)","v":""},null,{"$f":"IF(ISBLANK('8-Process Controls'!E179),\"\",'8-Process Controls'!E179)","v":""},{"$f":"IF(ISBLANK('8-Process Controls'!F179),\"\",'8-Process Controls'!F179)","v":""},{"$f":"IF(ISBLANK('8-Process Controls'!G179),\"\",IF(LEFT('8-Process Controls'!G179,1)=\"Y\",\"PT\",\"\"))","v":""},null,{"$f":"IF(ISBLANK('8-Process Controls'!S179),\"\",'8-Process Controls'!S179)","v":""},{"$f":"IF(ISBLANK('8-Process Controls'!T179),\"\",'8-Process Controls'!T179)","v":""},null,null,null,null,null,null,null,null,null,null,null,null,null,{"$f":"IF(ISBLANK('8-Process Controls'!U179),\"\",'8-Process Controls'!U179)","v":""}]
[{"$f":"IF(ISBLANK('8-Process Controls'!C180),\"\",'8-Process Controls'!C180)","v":""},{"$f":"IF(ISBLANK('8-Process Controls'!D180),\"\",'8-Process Controls'!D180)","v":""},null,{"$f":"IF(ISBLANK('8-Process Controls'!E180),\"\",'8-Process Controls'!E180)","v":""},{"$f":"IF(ISBLANK('8-Process Controls'!F180),\"\",'8-Process Controls'!F180)","v":""},{"$f":"IF(ISBLANK('8-Process Controls'!G180),\"\",IF(LEFT('8-Process Controls'!G180,1)=\"Y\",\"PT\",\"\"))","v":""},null,{"$f":"IF(ISBLANK('8-Process Controls'!S180),\"\",'8-Process Controls'!S180)","v":""},{"$f":"IF(ISBLANK('8-Process Controls'!T180),\"\",'8-Process Controls'!T180)","v":""},null,null,null,null,null,null,null,null,null,null,null,null,null,{"$f":"IF(ISBLANK('8-Process Controls'!U180),\"\",'8-Process Controls'!U180)","v":""}]
[{"$f":"IF(ISBLANK('8-Process Controls'!C181),\"\",'8-Process Controls'!C181)","v":""},{"$f":"IF(ISBLANK('8-Process Controls'!D181),\"\",'8-Process Controls'!D181)","v":""},null,{"$f":"IF(ISBLANK('8-Process Controls'!E181),\"\",'8-Process Controls'!E181)","v":""},{"$f":"IF(ISBLANK('8-Process Controls'!F181),\"\",'8-Process Controls'!F181)","v":""},{"$f":"IF(ISBLANK('8-Process Controls'!G181),\"\",IF(LEFT('8-Process Controls'!G181,1)=\"Y\",\"PT\",\"\"))","v":""},null,{"$f":"IF(ISBLANK('8-Process Controls'!S181),\"\",'8-Process Controls'!S181)","v":""},{"$f":"IF(ISBLANK('8-Process Controls'!T181),\"\",'8-Process Controls'!T181)","v":""},null,null,null,null,null,null,null,null,null,null,null,null,null,{"$f":"IF(ISBLANK('8-Process Controls'!U181),\"\",'8-Process Controls'!U181)","v":""}]
[{"$f":"IF(ISBLANK('8-Process Controls'!C182),\"\",'8-Process Controls'!C182)","v":""},{"$f":"IF(ISBLANK('8-Process Controls'!D182),\"\",'8-Process Controls'!D182)","v":""},null,{"$f":"IF(ISBLANK('8-Process Controls'!E182),\"\",'8-Process Controls'!E182)","v":""},{"$f":"IF(ISBLANK('8-Process Controls'!F182),\"\",'8-Process Controls'!F182)","v":""},{"$f":"IF(ISBLANK('8-Process Controls'!G182),\"\",IF(LEFT('8-Process Controls'!G182,1)=\"Y\",\"PT\",\"\"))","v":""},null,{"$f":"IF(ISBLANK('8-Process Controls'!S182),\"\",'8-Process Controls'!S182)","v":""},{"$f":"IF(ISBLANK('8-Process Controls'!T182),\"\",'8-Process Controls'!T182)","v":""},null,null,null,null,null,null,null,null,null,null,null,null,null,{"$f":"IF(ISBLANK('8-Process Controls'!U182),\"\",'8-Process Controls'!U182)","v":""}]
[{"$f":"IF(ISBLANK('8-Process Controls'!C183),\"\",'8-Process Controls'!C183)","v":""},{"$f":"IF(ISBLANK('8-Process Controls'!D183),\"\",'8-Process Controls'!D183)","v":""},null,{"$f":"IF(ISBLANK('8-Process Controls'!E183),\"\",'8-Process Controls'!E183)","v":""},{"$f":"IF(ISBLANK('8-Process Controls'!F183),\"\",'8-Process Controls'!F183)","v":""},{"$f":"IF(ISBLANK('8-Process Controls'!G183),\"\",IF(LEFT('8-Process Controls'!G183,1)=\"Y\",\"PT\",\"\"))","v":""},null,{"$f":"IF(ISBLANK('8-Process Controls'!S183),\"\",'8-Process Controls'!S183)","v":""},{"$f":"IF(ISBLANK('8-Process Controls'!T183),\"\",'8-Process Controls'!T183)","v":""},null,null,null,null,null,null,null,null,null,null,null,null,null,{"$f":"IF(ISBLANK('8-Process Controls'!U183),\"\",'8-Process Controls'!U183)","v":""}]
[{"$f":"IF(ISBLANK('8-Process Controls'!C184),\"\",'8-Process Controls'!C184)","v":""},{"$f":"IF(ISBLANK('8-Process Controls'!D184),\"\",'8-Process Controls'!D184)","v":""},null,{"$f":"IF(ISBLANK('8-Process Controls'!E184),\"\",'8-Process Controls'!E184)","v":""},{"$f":"IF(ISBLANK('8-Process Controls'!F184),\"\",'8-Process Controls'!F184)","v":""},{"$f":"IF(ISBLANK('8-Process Controls'!G184),\"\",IF(LEFT('8-Process Controls'!G184,1)=\"Y\",\"PT\",\"\"))","v":""},null,{"$f":"IF(ISBLANK('8-Process Controls'!S184),\"\",'8-Process Controls'!S184)","v":""},{"$f":"IF(ISBLANK('8-Process Controls'!T184),\"\",'8-Process Controls'!T184)","v":""},null,null,null,null,null,null,null,null,null,null,null,null,null,{"$f":"IF(ISBLANK('8-Process Controls'!U184),\"\",'8-Process Controls'!U184)","v":""}]
[{"$f":"IF(ISBLANK('8-Process Controls'!C185),\"\",'8-Process Controls'!C185)","v":""},{"$f":"IF(ISBLANK('8-Process Controls'!D185),\"\",'8-Process Controls'!D185)","v":""},null,{"$f":"IF(ISBLANK('8-Process Controls'!E185),\"\",'8-Process Controls'!E185)","v":""},{"$f":"IF(ISBLANK('8-Process Controls'!F185),\"\",'8-Process Controls'!F185)","v":""},{"$f":"IF(ISBLANK('8-Process Controls'!G185),\"\",IF(LEFT('8-Process Controls'!G185,1)=\"Y\",\"PT\",\"\"))","v":""},null,{"$f":"IF(ISBLANK('8-Process Controls'!S185),\"\",'8-Process Controls'!S185)","v":""},{"$f":"IF(ISBLANK('8-Process Controls'!T185),\"\",'8-Process Controls'!T185)","v":""},null,null,null,null,null,null,null,null,null,null,null,null,null,{"$f":"IF(ISBLANK('8-Process Controls'!U185),\"\",'8-Process Controls'!U185)","v":""}]
[{"$f":"IF(ISBLANK('8-Process Controls'!C186),\"\",'8-Process Controls'!C186)","v":""},{"$f":"IF(ISBLANK('8-Process Controls'!D186),\"\",'8-Process Controls'!D186)","v":""},null,{"$f":"IF(ISBLANK('8-Process Controls'!E186),\"\",'8-Process Controls'!E186)","v":""},{"$f":"IF(ISBLANK('8-Process Controls'!F186),\"\",'8-Process Controls'!F186)","v":""},{"$f":"IF(ISBLANK('8-Process Controls'!G186),\"\",IF(LEFT('8-Process Controls'!G186,1)=\"Y\",\"PT\",\"\"))","v":""},null,{"$f":"IF(ISBLANK('8-Process Controls'!S186),\"\",'8-Process Controls'!S186)","v":""},{"$f":"IF(ISBLANK('8-Process Controls'!T186),\"\",'8-Process Controls'!T186)","v":""},null,null,null,null,null,null,null,null,null,null,null,null,null,{"$f":"IF(ISBLANK('8-Process Controls'!U186),\"\",'8-Process Controls'!U186)","v":""}]
[{"$f":"IF(ISBLANK('8-Process Controls'!C187),\"\",'8-Process Controls'!C187)","v":""},{"$f":"IF(ISBLANK('8-Process Controls'!D187),\"\",'8-Process Controls'!D187)","v":""},null,{"$f":"IF(ISBLANK('8-Process Controls'!E187),\"\",'8-Process Controls'!E187)","v":""},{"$f":"IF(ISBLANK('8-Process Controls'!F187),\"\",'8-Process Controls'!F187)","v":""},{"$f":"IF(ISBLANK('8-Process Controls'!G187),\"\",IF(LEFT('8-Process Controls'!G187,1)=\"Y\",\"PT\",\"\"))","v":""},null,{"$f":"IF(ISBLANK('8-Process Controls'!S187),\"\",'8-Process Controls'!S187)","v":""},{"$f":"IF(ISBLANK('8-Process Controls'!T187),\"\",'8-Process Controls'!T187)","v":""},null,null,null,null,null,null,null,null,null,null,null,null,null,{"$f":"IF(ISBLANK('8-Process Controls'!U187),\"\",'8-Process Controls'!U187)","v":""}]
[{"$f":"IF(ISBLANK('8-Process Controls'!C188),\"\",'8-Process Controls'!C188)","v":""},{"$f":"IF(ISBLANK('8-Process Controls'!D188),\"\",'8-Process Controls'!D188)","v":""},null,{"$f":"IF(ISBLANK('8-Process Controls'!E188),\"\",'8-Process Controls'!E188)","v":""},{"$f":"IF(ISBLANK('8-Process Controls'!F188),\"\",'8-Process Controls'!F188)","v":""},{"$f":"IF(ISBLANK('8-Process Controls'!G188),\"\",IF(LEFT('8-Process Controls'!G188,1)=\"Y\",\"PT\",\"\"))","v":""},null,{"$f":"IF(ISBLANK('8-Process Controls'!S188),\"\",'8-Process Controls'!S188)","v":""},{"$f":"IF(ISBLANK('8-Process Controls'!T188),\"\",'8-Process Controls'!T188)","v":""},null,null,null,null,null,null,null,null,null,null,null,null,null,{"$f":"IF(ISBLANK('8-Process Controls'!U188),\"\",'8-Process Controls'!U188)","v":""}]
[{"$f":"IF(ISBLANK('8-Process Controls'!C189),\"\",'8-Process Controls'!C189)","v":""},{"$f":"IF(ISBLANK('8-Process Controls'!D189),\"\",'8-Process Controls'!D189)","v":""},null,{"$f":"IF(ISBLANK('8-Process Controls'!E189),\"\",'8-Process Controls'!E189)","v":""},{"$f":"IF(ISBLANK('8-Process Controls'!F189),\"\",'8-Process Controls'!F189)","v":""},{"$f":"IF(ISBLANK('8-Process Controls'!G189),\"\",IF(LEFT('8-Process Controls'!G189,1)=\"Y\",\"PT\",\"\"))","v":""},null,{"$f":"IF(ISBLANK('8-Process Controls'!S189),\"\",'8-Process Controls'!S189)","v":""},{"$f":"IF(ISBLANK('8-Process Controls'!T189),\"\",'8-Process Controls'!T189)","v":""},null,null,null,null,null,null,null,null,null,null,null,null,null,{"$f":"IF(ISBLANK('8-Process Controls'!U189),\"\",'8-Process Controls'!U189)","v":""}]
[{"$f":"IF(ISBLANK('8-Process Controls'!C190),\"\",'8-Process Controls'!C190)","v":""},{"$f":"IF(ISBLANK('8-Process Controls'!D190),\"\",'8-Process Controls'!D190)","v":""},null,{"$f":"IF(ISBLANK('8-Process Controls'!E190),\"\",'8-Process Controls'!E190)","v":""},{"$f":"IF(ISBLANK('8-Process Controls'!F190),\"\",'8-Process Controls'!F190)","v":""},{"$f":"IF(ISBLANK('8-Process Controls'!G190),\"\",IF(LEFT('8-Process Controls'!G190,1)=\"Y\",\"PT\",\"\"))","v":""},null,{"$f":"IF(ISBLANK('8-Process Controls'!S190),\"\",'8-Process Controls'!S190)","v":""},{"$f":"IF(ISBLANK('8-Process Controls'!T190),\"\",'8-Process Controls'!T190)","v":""},null,null,null,null,null,null,null,null,null,null,null,null,null,{"$f":"IF(ISBLANK('8-Process Controls'!U190),\"\",'8-Process Controls'!U190)","v":""}]
[{"$f":"IF(ISBLANK('8-Process Controls'!C191),\"\",'8-Process Controls'!C191)","v":""},{"$f":"IF(ISBLANK('8-Process Controls'!D191),\"\",'8-Process Controls'!D191)","v":""},null,{"$f":"IF(ISBLANK('8-Process Controls'!E191),\"\",'8-Process Controls'!E191)","v":""},{"$f":"IF(ISBLANK('8-Process Controls'!F191),\"\",'8-Process Controls'!F191)","v":""},{"$f":"IF(ISBLANK('8-Process Controls'!G191),\"\",IF(LEFT('8-Process Controls'!G191,1)=\"Y\",\"PT\",\"\"))","v":""},null,{"$f":"IF(ISBLANK('8-Process Controls'!S191),\"\",'8-Process Controls'!S191)","v":""},{"$f":"IF(ISBLANK('8-Process Controls'!T191),\"\",'8-Process Controls'!T191)","v":""},null,null,null,null,null,null,null,null,null,null,null,null,null,{"$f":"IF(ISBLANK('8-Process Controls'!U191),\"\",'8-Process Controls'!U191)","v":""}]
[{"$f":"IF(ISBLANK('8-Process Controls'!C192),\"\",'8-Process Controls'!C192)","v":""},{"$f":"IF(ISBLANK('8-Process Controls'!D192),\"\",'8-Process Controls'!D192)","v":""},null,{"$f":"IF(ISBLANK('8-Process Controls'!E192),\"\",'8-Process Controls'!E192)","v":""},{"$f":"IF(ISBLANK('8-Process Controls'!F192),\"\",'8-Process Controls'!F192)","v":""},{"$f":"IF(ISBLANK('8-Process Controls'!G192),\"\",IF(LEFT('8-Process Controls'!G192,1)=\"Y\",\"PT\",\"\"))","v":""},null,{"$f":"IF(ISBLANK('8-Process Controls'!S192),\"\",'8-Process Controls'!S192)","v":""},{"$f":"IF(ISBLANK('8-Process Controls'!T192),\"\",'8-Process Controls'!T192)","v":""},null,null,null,null,null,null,null,null,null,null,null,null,null,{"$f":"IF(ISBLANK('8-Process Controls'!U192),\"\",'8-Process Controls'!U192)","v":""}]
[{"$f":"IF(ISBLANK('8-Process Controls'!C193),\"\",'8-Process Controls'!C193)","v":""},{"$f":"IF(ISBLANK('8-Process Controls'!D193),\"\",'8-Process Controls'!D193)","v":""},null,{"$f":"IF(ISBLANK('8-Process Controls'!E193),\"\",'8-Process Controls'!E193)","v":""},{"$f":"IF(ISBLANK('8-Process Controls'!F193),\"\",'8-Process Controls'!F193)","v":""},{"$f":"IF(ISBLANK('8-Process Controls'!G193),\"\",IF(LEFT('8-Process Controls'!G193,1)=\"Y\",\"PT\",\"\"))","v":""},null,{"$f":"IF(ISBLANK('8-Process Controls'!S193),\"\",'8-Process Controls'!S193)","v":""},{"$f":"IF(ISBLANK('8-Process Controls'!T193),\"\",'8-Process Controls'!T193)","v":""},null,null,null,null,null,null,null,null,null,null,null,null,null,{"$f":"IF(ISBLANK('8-Process Controls'!U193),\"\",'8-Process Controls'!U193)","v":""}]
[{"$f":"IF(ISBLANK('8-Process Controls'!C194),\"\",'8-Process Controls'!C194)","v":""},{"$f":"IF(ISBLANK('8-Process Controls'!D194),\"\",'8-Process Controls'!D194)","v":""},null,{"$f":"IF(ISBLANK('8-Process Controls'!E194),\"\",'8-Process Controls'!E194)","v":""},{"$f":"IF(ISBLANK('8-Process Controls'!F194),\"\",'8-Process Controls'!F194)","v":""},{"$f":"IF(ISBLANK('8-Process Controls'!G194),\"\",IF(LEFT('8-Process Controls'!G194,1)=\"Y\",\"PT\",\"\"))","v":""},null,{"$f":"IF(ISBLANK('8-Process Controls'!S194),\"\",'8-Process Controls'!S194)","v":""},{"$f":"IF(ISBLANK('8-Process Controls'!T194),\"\",'8-Process Controls'!T194)","v":""},null,null,null,null,null,null,null,null,null,null,null,null,null,{"$f":"IF(ISBLANK('8-Process Controls'!U194),\"\",'8-Process Controls'!U194)","v":""}]
[{"$f":"IF(ISBLANK('8-Process Controls'!C195),\"\",'8-Process Controls'!C195)","v":""},{"$f":"IF(ISBLANK('8-Process Controls'!D195),\"\",'8-Process Controls'!D195)","v":""},null,{"$f":"IF(ISBLANK('8-Process Controls'!E195),\"\",'8-Process Controls'!E195)","v":""},{"$f":"IF(ISBLANK('8-Process Controls'!F195),\"\",'8-Process Controls'!F195)","v":""},{"$f":"IF(ISBLANK('8-Process Controls'!G195),\"\",IF(LEFT('8-Process Controls'!G195,1)=\"Y\",\"PT\",\"\"))","v":""},null,{"$f":"IF(ISBLANK('8-Process Controls'!S195),\"\",'8-Process Controls'!S195)","v":""},{"$f":"IF(ISBLANK('8-Process Controls'!T195),\"\",'8-Process Controls'!T195)","v":""},null,null,null,null,null,null,null,null,null,null,null,null,null,{"$f":"IF(ISBLANK('8-Process Controls'!U195),\"\",'8-Process Controls'!U195)","v":""}]
[{"$f":"IF(ISBLANK('8-Process Controls'!C196),\"\",'8-Process Controls'!C196)","v":""},{"$f":"IF(ISBLANK('8-Process Controls'!D196),\"\",'8-Process Controls'!D196)","v":""},null,{"$f":"IF(ISBLANK('8-Process Controls'!E196),\"\",'8-Process Controls'!E196)","v":""},{"$f":"IF(ISBLANK('8-Process Controls'!F196),\"\",'8-Process Controls'!F196)","v":""},{"$f":"IF(ISBLANK('8-Process Controls'!G196),\"\",IF(LEFT('8-Process Controls'!G196,1)=\"Y\",\"PT\",\"\"))","v":""},null,{"$f":"IF(ISBLANK('8-Process Controls'!S196),\"\",'8-Process Controls'!S196)","v":""},{"$f":"IF(ISBLANK('8-Process Controls'!T196),\"\",'8-Process Controls'!T196)","v":""},null,null,null,null,null,null,null,null,null,null,null,null,null,{"$f":"IF(ISBLANK('8-Process Controls'!U196),\"\",'8-Process Controls'!U196)","v":""}]
[{"$f":"IF(ISBLANK('8-Process Controls'!C197),\"\",'8-Process Controls'!C197)","v":""},{"$f":"IF(ISBLANK('8-Process Controls'!D197),\"\",'8-Process Controls'!D197)","v":""},null,{"$f":"IF(ISBLANK('8-Process Controls'!E197),\"\",'8-Process Controls'!E197)","v":""},{"$f":"IF(ISBLANK('8-Process Controls'!F197),\"\",'8-Process Controls'!F197)","v":""},{"$f":"IF(ISBLANK('8-Process Controls'!G197),\"\",IF(LEFT('8-Process Controls'!G197,1)=\"Y\",\"PT\",\"\"))","v":""},null,{"$f":"IF(ISBLANK('8-Process Controls'!S197),\"\",'8-Process Controls'!S197)","v":""},{"$f":"IF(ISBLANK('8-Process Controls'!T197),\"\",'8-Process Controls'!T197)","v":""},null,null,null,null,null,null,null,null,null,null,null,null,null,{"$f":"IF(ISBLANK('8-Process Controls'!U197),\"\",'8-Process Controls'!U197)","v":""}]
[{"$f":"IF(ISBLANK('8-Process Controls'!C198),\"\",'8-Process Controls'!C198)","v":""},{"$f":"IF(ISBLANK('8-Process Controls'!D198),\"\",'8-Process Controls'!D198)","v":""},null,{"$f":"IF(ISBLANK('8-Process Controls'!E198),\"\",'8-Process Controls'!E198)","v":""},{"$f":"IF(ISBLANK('8-Process Controls'!F198),\"\",'8-Process Controls'!F198)","v":""},{"$f":"IF(ISBLANK('8-Process Controls'!G198),\"\",IF(LEFT('8-Process Controls'!G198,1)=\"Y\",\"PT\",\"\"))","v":""},null,{"$f":"IF(ISBLANK('8-Process Controls'!S198),\"\",'8-Process Controls'!S198)","v":""},{"$f":"IF(ISBLANK('8-Process Controls'!T198),\"\",'8-Process Controls'!T198)","v":""},null,null,null,null,null,null,null,null,null,null,null,null,null,{"$f":"IF(ISBLANK('8-Process Controls'!U198),\"\",'8-Process Controls'!U198)","v":""}]
[{"$f":"IF(ISBLANK('8-Process Controls'!C199),\"\",'8-Process Controls'!C199)","v":""},{"$f":"IF(ISBLANK('8-Process Controls'!D199),\"\",'8-Process Controls'!D199)","v":""},null,{"$f":"IF(ISBLANK('8-Process Controls'!E199),\"\",'8-Process Controls'!E199)","v":""},{"$f":"IF(ISBLANK('8-Process Controls'!F199),\"\",'8-Process Controls'!F199)","v":""},{"$f":"IF(ISBLANK('8-Process Controls'!G199),\"\",IF(LEFT('8-Process Controls'!G199,1)=\"Y\",\"PT\",\"\"))","v":""},null,{"$f":"IF(ISBLANK('8-Process Controls'!S199),\"\",'8-Process Controls'!S199)","v":""},{"$f":"IF(ISBLANK('8-Process Controls'!T199),\"\",'8-Process Controls'!T199)","v":""},null,null,null,null,null,null,null,null,null,null,null,null,null,{"$f":"IF(ISBLANK('8-Process Controls'!U199),\"\",'8-Process Controls'!U199)","v":""}]
[{"$f":"IF(ISBLANK('8-Process Controls'!C200),\"\",'8-Process Controls'!C200)","v":""},{"$f":"IF(ISBLANK('8-Process Controls'!D200),\"\",'8-Process Controls'!D200)","v":""},null,{"$f":"IF(ISBLANK('8-Process Controls'!E200),\"\",'8-Process Controls'!E200)","v":""},{"$f":"IF(ISBLANK('8-Process Controls'!F200),\"\",'8-Process Controls'!F200)","v":""},{"$f":"IF(ISBLANK('8-Process Controls'!G200),\"\",IF(LEFT('8-Process Controls'!G200,1)=\"Y\",\"PT\",\"\"))","v":""},null,{"$f":"IF(ISBLANK('8-Process Controls'!S200),\"\",'8-Process Controls'!S200)","v":""},{"$f":"IF(ISBLANK('8-Process Controls'!T200),\"\",'8-Process Controls'!T200)","v":""},null,null,null,null,null,null,null,null,null,null,null,null,null,{"$f":"IF(ISBLANK('8-Process Controls'!U200),\"\",'8-Process Controls'!U200)","v":""}]
[{"$f":"IF(ISBLANK('8-Process Controls'!C201),\"\",'8-Process Controls'!C201)","v":""},{"$f":"IF(ISBLANK('8-Process Controls'!D201),\"\",'8-Process Controls'!D201)","v":""},null,{"$f":"IF(ISBLANK('8-Process Controls'!E201),\"\",'8-Process Controls'!E201)","v":""},{"$f":"IF(ISBLANK('8-Process Controls'!F201),\"\",'8-Process Controls'!F201)","v":""},{"$f":"IF(ISBLANK('8-Process Controls'!G201),\"\",IF(LEFT('8-Process Controls'!G201,1)=\"Y\",\"PT\",\"\"))","v":""},null,{"$f":"IF(ISBLANK('8-Process Controls'!S201),\"\",'8-Process Controls'!S201)","v":""},{"$f":"IF(ISBLANK('8-Process Controls'!T201),\"\",'8-Process Controls'!T201)","v":""},null,null,null,null,null,null,null,null,null,null,null,null,null,{"$f":"IF(ISBLANK('8-Process Controls'!U201),\"\",'8-Process Controls'!U201)","v":""}]
[{"$f":"IF(ISBLANK('8-Process Controls'!C202),\"\",'8-Process Controls'!C202)","v":""},{"$f":"IF(ISBLANK('8-Process Controls'!D202),\"\",'8-Process Controls'!D202)","v":""},null,{"$f":"IF(ISBLANK('8-Process Controls'!E202),\"\",'8-Process Controls'!E202)","v":""},{"$f":"IF(ISBLANK('8-Process Controls'!F202),\"\",'8-Process Controls'!F202)","v":""},{"$f":"IF(ISBLANK('8-Process Controls'!G202),\"\",IF(LEFT('8-Process Controls'!G202,1)=\"Y\",\"PT\",\"\"))","v":""},null,{"$f":"IF(ISBLANK('8-Process Controls'!S202),\"\",'8-Process Controls'!S202)","v":""},{"$f":"IF(ISBLANK('8-Process Controls'!T202),\"\",'8-Process Controls'!T202)","v":""},null,null,null,null,null,null,null,null,null,null,null,null,null,{"$f":"IF(ISBLANK('8-Process Controls'!U202),\"\",'8-Process Controls'!U202)","v":""}]
[{"$f":"IF(ISBLANK('8-Process Controls'!C203),\"\",'8-Process Controls'!C203)","v":""},{"$f":"IF(ISBLANK('8-Process Controls'!D203),\"\",'8-Process Controls'!D203)","v":""},null,{"$f":"IF(ISBLANK('8-Process Controls'!E203),\"\",'8-Process Controls'!E203)","v":""},{"$f":"IF(ISBLANK('8-Process Controls'!F203),\"\",'8-Process Controls'!F203)","v":""},{"$f":"IF(ISBLANK('8-Process Controls'!G203),\"\",IF(LEFT('8-Process Controls'!G203,1)=\"Y\",\"PT\",\"\"))","v":""},null,{"$f":"IF(ISBLANK('8-Process Controls'!S203),\"\",'8-Process Controls'!S203)","v":""},{"$f":"IF(ISBLANK('8-Process Controls'!T203),\"\",'8-Process Controls'!T203)","v":""},null,null,null,null,null,null,null,null,null,null,null,null,null,{"$f":"IF(ISBLANK('8-Process Controls'!U203),\"\",'8-Process Controls'!U203)","v":""}]
[{"$f":"IF(ISBLANK('8-Process Controls'!C204),\"\",'8-Process Controls'!C204)","v":""},{"$f":"IF(ISBLANK('8-Process Controls'!D204),\"\",'8-Process Controls'!D204)","v":""},null,{"$f":"IF(ISBLANK('8-Process Controls'!E204),\"\",'8-Process Controls'!E204)","v":""},{"$f":"IF(ISBLANK('8-Process Controls'!F204),\"\",'8-Process Controls'!F204)","v":""},{"$f":"IF(ISBLANK('8-Process Controls'!G204),\"\",IF(LEFT('8-Process Controls'!G204,1)=\"Y\",\"PT\",\"\"))","v":""},null,{"$f":"IF(ISBLANK('8-Process Controls'!S204),\"\",'8-Process Controls'!S204)","v":""},{"$f":"IF(ISBLANK('8-Process Controls'!T204),\"\",'8-Process Controls'!T204)","v":""},null,null,null,null,null,null,null,null,null,null,null,null,null,{"$f":"IF(ISBLANK('8-Process Controls'!U204),\"\",'8-Process Controls'!U204)","v":""}]
[{"$f":"IF(ISBLANK('8-Process Controls'!C205),\"\",'8-Process Controls'!C205)","v":""},{"$f":"IF(ISBLANK('8-Process Controls'!D205),\"\",'8-Process Controls'!D205)","v":""},null,{"$f":"IF(ISBLANK('8-Process Controls'!E205),\"\",'8-Process Controls'!E205)","v":""},{"$f":"IF(ISBLANK('8-Process Controls'!F205),\"\",'8-Process Controls'!F205)","v":""},{"$f":"IF(ISBLANK('8-Process Controls'!G205),\"\",IF(LEFT('8-Process Controls'!G205,1)=\"Y\",\"PT\",\"\"))","v":""},null,{"$f":"IF(ISBLANK('8-Process Controls'!S205),\"\",'8-Process Controls'!S205)","v":""},{"$f":"IF(ISBLANK('8-Process Controls'!T205),\"\",'8-Process Controls'!T205)","v":""},null,null,null,null,null,null,null,null,null,null,null,null,null,{"$f":"IF(ISBLANK('8-Process Controls'!U205),\"\",'8-Process Controls'!U205)","v":""}]
[{"$f":"IF(ISBLANK('8-Process Controls'!C206),\"\",'8-Process Controls'!C206)","v":""},{"$f":"IF(ISBLANK('8-Process Controls'!D206),\"\",'8-Process Controls'!D206)","v":""},null,{"$f":"IF(ISBLANK('8-Process Controls'!E206),\"\",'8-Process Controls'!E206)","v":""},{"$f":"IF(ISBLANK('8-Process Controls'!F206),\"\",'8-Process Controls'!F206)","v":""},{"$f":"IF(ISBLANK('8-Process Controls'!G206),\"\",IF(LEFT('8-Process Controls'!G206,1)=\"Y\",\"PT\",\"\"))","v":""},null,{"$f":"IF(ISBLANK('8-Process Controls'!S206),\"\",'8-Process Controls'!S206)","v":""},{"$f":"IF(ISBLANK('8-Process Controls'!T206),\"\",'8-Process Controls'!T206)","v":""},null,null,null,null,null,null,null,null,null,null,null,null,null,{"$f":"IF(ISBLANK('8-Process Controls'!U206),\"\",'8-Process Controls'!U206)","v":""}]
[{"$f":"IF(ISBLANK('8-Process Controls'!C207),\"\",'8-Process Controls'!C207)","v":""},{"$f":"IF(ISBLANK('8-Process Controls'!D207),\"\",'8-Process Controls'!D207)","v":""},null,{"$f":"IF(ISBLANK('8-Process Controls'!E207),\"\",'8-Process Controls'!E207)","v":""},{"$f":"IF(ISBLANK('8-Process Controls'!F207),\"\",'8-Process Controls'!F207)","v":""},{"$f":"IF(ISBLANK('8-Process Controls'!G207),\"\",IF(LEFT('8-Process Controls'!G207,1)=\"Y\",\"PT\",\"\"))","v":""},null,{"$f":"IF(ISBLANK('8-Process Controls'!S207),\"\",'8-Process Controls'!S207)","v":""},{"$f":"IF(ISBLANK('8-Process Controls'!T207),\"\",'8-Process Controls'!T207)","v":""},null,null,null,null,null,null,null,null,null,null,null,null,null,{"$f":"IF(ISBLANK('8-Process Controls'!U207),\"\",'8-Process Controls'!U207)","v":""}]
[{"$f":"IF(ISBLANK('8-Process Controls'!C208),\"\",'8-Process Controls'!C208)","v":""},{"$f":"IF(ISBLANK('8-Process Controls'!D208),\"\",'8-Process Controls'!D208)","v":""},null,{"$f":"IF(ISBLANK('8-Process Controls'!E208),\"\",'8-Process Controls'!E208)","v":""},{"$f":"IF(ISBLANK('8-Process Controls'!F208),\"\",'8-Process Controls'!F208)","v":""},{"$f":"IF(ISBLANK('8-Process Controls'!G208),\"\",IF(LEFT('8-Process Controls'!G208,1)=\"Y\",\"PT\",\"\"))","v":""},null,{"$f":"IF(ISBLANK('8-Process Controls'!S208),\"\",'8-Process Controls'!S208)","v":""},{"$f":"IF(ISBLANK('8-Process Controls'!T208),\"\",'8-Process Controls'!T208)","v":""},null,null,null,null,null,null,null,null,null,null,null,null,null,{"$f":"IF(ISBLANK('8-Process Controls'!U208),\"\",'8-Process Controls'!U208)","v":""}]
[{"$f":"IF(ISBLANK('8-Process Controls'!C209),\"\",'8-Process Controls'!C209)","v":""},{"$f":"IF(ISBLANK('8-Process Controls'!D209),\"\",'8-Process Controls'!D209)","v":""},null,{"$f":"IF(ISBLANK('8-Process Controls'!E209),\"\",'8-Process Controls'!E209)","v":""},{"$f":"IF(ISBLANK('8-Process Controls'!F209),\"\",'8-Process Controls'!F209)","v":""},{"$f":"IF(ISBLANK('8-Process Controls'!G209),\"\",IF(LEFT('8-Process Controls'!G209,1)=\"Y\",\"PT\",\"\"))","v":""},null,{"$f":"IF(ISBLANK('8-Process Controls'!S209),\"\",'8-Process Controls'!S209)","v":""},{"$f":"IF(ISBLANK('8-Process Controls'!T209),\"\",'8-Process Controls'!T209)","v":""},null,null,null,null,null,null,null,null,null,null,null,null,null,{"$f":"IF(ISBLANK('8-Process Controls'!U209),\"\",'8-Process Controls'!U209)","v":""}]
[{"$f":"IF(ISBLANK('8-Process Controls'!C210),\"\",'8-Process Controls'!C210)","v":""},{"$f":"IF(ISBLANK('8-Process Controls'!D210),\"\",'8-Process Controls'!D210)","v":""},null,{"$f":"IF(ISBLANK('8-Process Controls'!E210),\"\",'8-Process Controls'!E210)","v":""},{"$f":"IF(ISBLANK('8-Process Controls'!F210),\"\",'8-Process Controls'!F210)","v":""},{"$f":"IF(ISBLANK('8-Process Controls'!G210),\"\",IF(LEFT('8-Process Controls'!G210,1)=\"Y\",\"PT\",\"\"))","v":""},null,{"$f":"IF(ISBLANK('8-Process Controls'!S210),\"\",'8-Process Controls'!S210)","v":""},{"$f":"IF(ISBLANK('8-Process Controls'!T210),\"\",'8-Process Controls'!T210)","v":""},null,null,null,null,null,null,null,null,null,null,null,null,null,{"$f":"IF(ISBLANK('8-Process Controls'!U210),\"\",'8-Process Controls'!U210)","v":""}]
[{"$f":"IF(ISBLANK('8-Process Controls'!C211),\"\",'8-Process Controls'!C211)","v":""},{"$f":"IF(ISBLANK('8-Process Controls'!D211),\"\",'8-Process Controls'!D211)","v":""},null,{"$f":"IF(ISBLANK('8-Process Controls'!E211),\"\",'8-Process Controls'!E211)","v":""},{"$f":"IF(ISBLANK('8-Process Controls'!F211),\"\",'8-Process Controls'!F211)","v":""},{"$f":"IF(ISBLANK('8-Process Controls'!G211),\"\",IF(LEFT('8-Process Controls'!G211,1)=\"Y\",\"PT\",\"\"))","v":""},null,{"$f":"IF(ISBLANK('8-Process Controls'!S211),\"\",'8-Process Controls'!S211)","v":""},{"$f":"IF(ISBLANK('8-Process Controls'!T211),\"\",'8-Process Controls'!T211)","v":""},null,null,null,null,null,null,null,null,null,null,null,null,null,{"$f":"IF(ISBLANK('8-Process Controls'!U211),\"\",'8-Process Controls'!U211)","v":""}]
[{"$f":"IF(ISBLANK('8-Process Controls'!C212),\"\",'8-Process Controls'!C212)","v":""},{"$f":"IF(ISBLANK('8-Process Controls'!D212),\"\",'8-Process Controls'!D212)","v":""},null,{"$f":"IF(ISBLANK('8-Process Controls'!E212),\"\",'8-Process Controls'!E212)","v":""},{"$f":"IF(ISBLANK('8-Process Controls'!F212),\"\",'8-Process Controls'!F212)","v":""},{"$f":"IF(ISBLANK('8-Process Controls'!G212),\"\",IF(LEFT('8-Process Controls'!G212,1)=\"Y\",\"PT\",\"\"))","v":""},null,{"$f":"IF(ISBLANK('8-Process Controls'!S212),\"\",'8-Process Controls'!S212)","v":""},{"$f":"IF(ISBLANK('8-Process Controls'!T212),\"\",'8-Process Controls'!T212)","v":""},null,null,null,null,null,null,null,null,null,null,null,null,null,{"$f":"IF(ISBLANK('8-Process Controls'!U212),\"\",'8-Process Controls'!U212)","v":""}]
[{"$f":"IF(ISBLANK('8-Process Controls'!C213),\"\",'8-Process Controls'!C213)","v":""},{"$f":"IF(ISBLANK('8-Process Controls'!D213),\"\",'8-Process Controls'!D213)","v":""},null,{"$f":"IF(ISBLANK('8-Process Controls'!E213),\"\",'8-Process Controls'!E213)","v":""},{"$f":"IF(ISBLANK('8-Process Controls'!F213),\"\",'8-Process Controls'!F213)","v":""},{"$f":"IF(ISBLANK('8-Process Controls'!G213),\"\",IF(LEFT('8-Process Controls'!G213,1)=\"Y\",\"PT\",\"\"))","v":""},null,{"$f":"IF(ISBLANK('8-Process Controls'!S213),\"\",'8-Process Controls'!S213)","v":""},{"$f":"IF(ISBLANK('8-Process Controls'!T213),\"\",'8-Process Controls'!T213)","v":""},null,null,null,null,null,null,null,null,null,null,null,null,null,{"$f":"IF(ISBLANK('8-Process Controls'!U213),\"\",'8-Process Controls'!U213)","v":""}]
[{"$f":"IF(ISBLANK('8-Process Controls'!C214),\"\",'8-Process Controls'!C214)","v":""},{"$f":"IF(ISBLANK('8-Process Controls'!D214),\"\",'8-Process Controls'!D214)","v":""},null,{"$f":"IF(ISBLANK('8-Process Controls'!E214),\"\",'8-Process Controls'!E214)","v":""},{"$f":"IF(ISBLANK('8-Process Controls'!F214),\"\",'8-Process Controls'!F214)","v":""},{"$f":"IF(ISBLANK('8-Process Controls'!G214),\"\",IF(LEFT('8-Process Controls'!G214,1)=\"Y\",\"PT\",\"\"))","v":""},null,{"$f":"IF(ISBLANK('8-Process Controls'!S214),\"\",'8-Process Controls'!S214)","v":""},{"$f":"IF(ISBLANK('8-Process Controls'!T214),\"\",'8-Process Controls'!T214)","v":""},null,null,null,null,null,null,null,null,null,null,null,null,null,{"$f":"IF(ISBLANK('8-Process Controls'!U214),\"\",'8-Process Controls'!U214)","v":""}]
[{"$f":"IF(ISBLANK('8-Process Controls'!C215),\"\",'8-Process Controls'!C215)","v":""},{"$f":"IF(ISBLANK('8-Process Controls'!D215),\"\",'8-Process Controls'!D215)","v":""},null,{"$f":"IF(ISBLANK('8-Process Controls'!E215),\"\",'8-Process Controls'!E215)","v":""},{"$f":"IF(ISBLANK('8-Process Controls'!F215),\"\",'8-Process Controls'!F215)","v":""},{"$f":"IF(ISBLANK('8-Process Controls'!G215),\"\",IF(LEFT('8-Process Controls'!G215,1)=\"Y\",\"PT\",\"\"))","v":""},null,{"$f":"IF(ISBLANK('8-Process Controls'!S215),\"\",'8-Process Controls'!S215)","v":""},{"$f":"IF(ISBLANK('8-Process Controls'!T215),\"\",'8-Process Controls'!T215)","v":""},null,null,null,null,null,null,null,null,null,null,null,null,null,{"$f":"IF(ISBLANK('8-Process Controls'!U215),\"\",'8-Process Controls'!U215)","v":""}]
[{"$f":"IF(ISBLANK('8-Process Controls'!C216),\"\",'8-Process Controls'!C216)","v":""},{"$f":"IF(ISBLANK('8-Process Controls'!D216),\"\",'8-Process Controls'!D216)","v":""},null,{"$f":"IF(ISBLANK('8-Process Controls'!E216),\"\",'8-Process Controls'!E216)","v":""},{"$f":"IF(ISBLANK('8-Process Controls'!F216),\"\",'8-Process Controls'!F216)","v":""},{"$f":"IF(ISBLANK('8-Process Controls'!G216),\"\",IF(LEFT('8-Process Controls'!G216,1)=\"Y\",\"PT\",\"\"))","v":""},null,{"$f":"IF(ISBLANK('8-Process Controls'!S216),\"\",'8-Process Controls'!S216)","v":""},{"$f":"IF(ISBLANK('8-Process Controls'!T216),\"\",'8-Process Controls'!T216)","v":""},null,null,null,null,null,null,null,null,null,null,null,null,null,{"$f":"IF(ISBLANK('8-Process Controls'!U216),\"\",'8-Process Controls'!U216)","v":""}]
[{"$f":"IF(ISBLANK('8-Process Controls'!C217),\"\",'8-Process Controls'!C217)","v":""},{"$f":"IF(ISBLANK('8-Process Controls'!D217),\"\",'8-Process Controls'!D217)","v":""},null,{"$f":"IF(ISBLANK('8-Process Controls'!E217),\"\",'8-Process Controls'!E217)","v":""},{"$f":"IF(ISBLANK('8-Process Controls'!F217),\"\",'8-Process Controls'!F217)","v":""},{"$f":"IF(ISBLANK('8-Process Controls'!G217),\"\",IF(LEFT('8-Process Controls'!G217,1)=\"Y\",\"PT\",\"\"))","v":""},null,{"$f":"IF(ISBLANK('8-Process Controls'!S217),\"\",'8-Process Controls'!S217)","v":""},{"$f":"IF(ISBLANK('8-Process Controls'!T217),\"\",'8-Process Controls'!T217)","v":""},null,null,null,null,null,null,null,null,null,null,null,null,null,{"$f":"IF(ISBLANK('8-Process Controls'!U217),\"\",'8-Process Controls'!U217)","v":""}]
[{"$f":"IF(ISBLANK('8-Process Controls'!C218),\"\",'8-Process Controls'!C218)","v":""},{"$f":"IF(ISBLANK('8-Process Controls'!D218),\"\",'8-Process Controls'!D218)","v":""},null,{"$f":"IF(ISBLANK('8-Process Controls'!E218),\"\",'8-Process Controls'!E218)","v":""},{"$f":"IF(ISBLANK('8-Process Controls'!F218),\"\",'8-Process Controls'!F218)","v":""},{"$f":"IF(ISBLANK('8-Process Controls'!G218),\"\",IF(LEFT('8-Process Controls'!G218,1)=\"Y\",\"PT\",\"\"))","v":""},null,{"$f":"IF(ISBLANK('8-Process Controls'!S218),\"\",'8-Process Controls'!S218)","v":""},{"$f":"IF(ISBLANK('8-Process Controls'!T218),\"\",'8-Process Controls'!T218)","v":""},null,null,null,null,null,null,null,null,null,null,null,null,null,{"$f":"IF(ISBLANK('8-Process Controls'!U218),\"\",'8-Process Controls'!U218)","v":""}]
[{"$f":"IF(ISBLANK('8-Process Controls'!C219),\"\",'8-Process Controls'!C219)","v":""},{"$f":"IF(ISBLANK('8-Process Controls'!D219),\"\",'8-Process Controls'!D219)","v":""},null,{"$f":"IF(ISBLANK('8-Process Controls'!E219),\"\",'8-Process Controls'!E219)","v":""},{"$f":"IF(ISBLANK('8-Process Controls'!F219),\"\",'8-Process Controls'!F219)","v":""},{"$f":"IF(ISBLANK('8-Process Controls'!G219),\"\",IF(LEFT('8-Process Controls'!G219,1)=\"Y\",\"PT\",\"\"))","v":""},null,{"$f":"IF(ISBLANK('8-Process Controls'!S219),\"\",'8-Process Controls'!S219)","v":""},{"$f":"IF(ISBLANK('8-Process Controls'!T219),\"\",'8-Process Controls'!T219)","v":""},null,null,null,null,null,null,null,null,null,null,null,null,null,{"$f":"IF(ISBLANK('8-Process Controls'!U219),\"\",'8-Process Controls'!U219)","v":""}]
[{"$f":"IF(ISBLANK('8-Process Controls'!C220),\"\",'8-Process Controls'!C220)","v":""},{"$f":"IF(ISBLANK('8-Process Controls'!D220),\"\",'8-Process Controls'!D220)","v":""},null,{"$f":"IF(ISBLANK('8-Process Controls'!E220),\"\",'8-Process Controls'!E220)","v":""},{"$f":"IF(ISBLANK('8-Process Controls'!F220),\"\",'8-Process Controls'!F220)","v":""},{"$f":"IF(ISBLANK('8-Process Controls'!G220),\"\",IF(LEFT('8-Process Controls'!G220,1)=\"Y\",\"PT\",\"\"))","v":""},null,{"$f":"IF(ISBLANK('8-Process Controls'!S220),\"\",'8-Process Controls'!S220)","v":""},{"$f":"IF(ISBLANK('8-Process Controls'!T220),\"\",'8-Process Controls'!T220)","v":""},null,null,null,null,null,null,null,null,null,null,null,null,null,{"$f":"IF(ISBLANK('8-Process Controls'!U220),\"\",'8-Process Controls'!U220)","v":""}]
[{"$f":"IF(ISBLANK('8-Process Controls'!C221),\"\",'8-Process Controls'!C221)","v":""},{"$f":"IF(ISBLANK('8-Process Controls'!D221),\"\",'8-Process Controls'!D221)","v":""},null,{"$f":"IF(ISBLANK('8-Process Controls'!E221),\"\",'8-Process Controls'!E221)","v":""},{"$f":"IF(ISBLANK('8-Process Controls'!F221),\"\",'8-Process Controls'!F221)","v":""},{"$f":"IF(ISBLANK('8-Process Controls'!G221),\"\",IF(LEFT('8-Process Controls'!G221,1)=\"Y\",\"PT\",\"\"))","v":""},null,{"$f":"IF(ISBLANK('8-Process Controls'!S221),\"\",'8-Process Controls'!S221)","v":""},{"$f":"IF(ISBLANK('8-Process Controls'!T221),\"\",'8-Process Controls'!T221)","v":""},null,null,null,null,null,null,null,null,null,null,null,null,null,{"$f":"IF(ISBLANK('8-Process Controls'!U221),\"\",'8-Process Controls'!U221)","v":""}]
[{"$f":"IF(ISBLANK('8-Process Controls'!C222),\"\",'8-Process Controls'!C222)","v":""},{"$f":"IF(ISBLANK('8-Process Controls'!D222),\"\",'8-Process Controls'!D222)","v":""},null,{"$f":"IF(ISBLANK('8-Process Controls'!E222),\"\",'8-Process Controls'!E222)","v":""},{"$f":"IF(ISBLANK('8-Process Controls'!F222),\"\",'8-Process Controls'!F222)","v":""},{"$f":"IF(ISBLANK('8-Process Controls'!G222),\"\",IF(LEFT('8-Process Controls'!G222,1)=\"Y\",\"PT\",\"\"))","v":""},null,{"$f":"IF(ISBLANK('8-Process Controls'!S222),\"\",'8-Process Controls'!S222)","v":""},{"$f":"IF(ISBLANK('8-Process Controls'!T222),\"\",'8-Process Controls'!T222)","v":""},null,null,null,null,null,null,null,null,null,null,null,null,null,{"$f":"IF(ISBLANK('8-Process Controls'!U222),\"\",'8-Process Controls'!U222)","v":""}]
[{"$f":"IF(ISBLANK('8-Process Controls'!C223),\"\",'8-Process Controls'!C223)","v":""},{"$f":"IF(ISBLANK('8-Process Controls'!D223),\"\",'8-Process Controls'!D223)","v":""},null,{"$f":"IF(ISBLANK('8-Process Controls'!E223),\"\",'8-Process Controls'!E223)","v":""},{"$f":"IF(ISBLANK('8-Process Controls'!F223),\"\",'8-Process Controls'!F223)","v":""},{"$f":"IF(ISBLANK('8-Process Controls'!G223),\"\",IF(LEFT('8-Process Controls'!G223,1)=\"Y\",\"PT\",\"\"))","v":""},null,{"$f":"IF(ISBLANK('8-Process Controls'!S223),\"\",'8-Process Controls'!S223)","v":""},{"$f":"IF(ISBLANK('8-Process Controls'!T223),\"\",'8-Process Controls'!T223)","v":""},null,null,null,null,null,null,null,null,null,null,null,null,null,{"$f":"IF(ISBLANK('8-Process Controls'!U223),\"\",'8-Process Controls'!U223)","v":""}]
[{"$f":"IF(ISBLANK('8-Process Controls'!C224),\"\",'8-Process Controls'!C224)","v":""},{"$f":"IF(ISBLANK('8-Process Controls'!D224),\"\",'8-Process Controls'!D224)","v":""},null,{"$f":"IF(ISBLANK('8-Process Controls'!E224),\"\",'8-Process Controls'!E224)","v":""},{"$f":"IF(ISBLANK('8-Process Controls'!F224),\"\",'8-Process Controls'!F224)","v":""},{"$f":"IF(ISBLANK('8-Process Controls'!G224),\"\",IF(LEFT('8-Process Controls'!G224,1)=\"Y\",\"PT\",\"\"))","v":""},null,{"$f":"IF(ISBLANK('8-Process Controls'!S224),\"\",'8-Process Controls'!S224)","v":""},{"$f":"IF(ISBLANK('8-Process Controls'!T224),\"\",'8-Process Controls'!T224)","v":""},null,null,null,null,null,null,null,null,null,null,null,null,null,{"$f":"IF(ISBLANK('8-Process Controls'!U224),\"\",'8-Process Controls'!U224)","v":""}]
[{"$f":"IF(ISBLANK('8-Process Controls'!C225),\"\",'8-Process Controls'!C225)","v":""},{"$f":"IF(ISBLANK('8-Process Controls'!D225),\"\",'8-Process Controls'!D225)","v":""},null,{"$f":"IF(ISBLANK('8-Process Controls'!E225),\"\",'8-Process Controls'!E225)","v":""},{"$f":"IF(ISBLANK('8-Process Controls'!F225),\"\",'8-Process Controls'!F225)","v":""},{"$f":"IF(ISBLANK('8-Process Controls'!G225),\"\",IF(LEFT('8-Process Controls'!G225,1)=\"Y\",\"PT\",\"\"))","v":""},null,{"$f":"IF(ISBLANK('8-Process Controls'!S225),\"\",'8-Process Controls'!S225)","v":""},{"$f":"IF(ISBLANK('8-Process Controls'!T225),\"\",'8-Process Controls'!T225)","v":""},null,null,null,null,null,null,null,null,null,null,null,null,null,{"$f":"IF(ISBLANK('8-Process Controls'!U225),\"\",'8-Process Controls'!U225)","v":""}]
[{"$f":"IF(ISBLANK('8-Process Controls'!C226),\"\",'8-Process Controls'!C226)","v":""},{"$f":"IF(ISBLANK('8-Process Controls'!D226),\"\",'8-Process Controls'!D226)","v":""},null,{"$f":"IF(ISBLANK('8-Process Controls'!E226),\"\",'8-Process Controls'!E226)","v":""},{"$f":"IF(ISBLANK('8-Process Controls'!F226),\"\",'8-Process Controls'!F226)","v":""},{"$f":"IF(ISBLANK('8-Process Controls'!G226),\"\",IF(LEFT('8-Process Controls'!G226,1)=\"Y\",\"PT\",\"\"))","v":""},null,{"$f":"IF(ISBLANK('8-Process Controls'!S226),\"\",'8-Process Controls'!S226)","v":""},{"$f":"IF(ISBLANK('8-Process Controls'!T226),\"\",'8-Process Controls'!T226)","v":""},null,null,null,null,null,null,null,null,null,null,null,null,null,{"$f":"IF(ISBLANK('8-Process Controls'!U226),\"\",'8-Process Controls'!U226)","v":""}]
[{"$f":"IF(ISBLANK('8-Process Controls'!C227),\"\",'8-Process Controls'!C227)","v":""},{"$f":"IF(ISBLANK('8-Process Controls'!D227),\"\",'8-Process Controls'!D227)","v":""},null,{"$f":"IF(ISBLANK('8-Process Controls'!E227),\"\",'8-Process Controls'!E227)","v":""},{"$f":"IF(ISBLANK('8-Process Controls'!F227),\"\",'8-Process Controls'!F227)","v":""},{"$f":"IF(ISBLANK('8-Process Controls'!G227),\"\",IF(LEFT('8-Process Controls'!G227,1)=\"Y\",\"PT\",\"\"))","v":""},null,{"$f":"IF(ISBLANK('8-Process Controls'!S227),\"\",'8-Process Controls'!S227)","v":""},{"$f":"IF(ISBLANK('8-Process Controls'!T227),\"\",'8-Process Controls'!T227)","v":""},null,null,null,null,null,null,null,null,null,null,null,null,null,{"$f":"IF(ISBLANK('8-Process Controls'!U227),\"\",'8-Process Controls'!U227)","v":""}]
[{"$f":"IF(ISBLANK('8-Process Controls'!C228),\"\",'8-Process Controls'!C228)","v":""},{"$f":"IF(ISBLANK('8-Process Controls'!D228),\"\",'8-Process Controls'!D228)","v":""},null,{"$f":"IF(ISBLANK('8-Process Controls'!E228),\"\",'8-Process Controls'!E228)","v":""},{"$f":"IF(ISBLANK('8-Process Controls'!F228),\"\",'8-Process Controls'!F228)","v":""},{"$f":"IF(ISBLANK('8-Process Controls'!G228),\"\",IF(LEFT('8-Process Controls'!G228,1)=\"Y\",\"PT\",\"\"))","v":""},null,{"$f":"IF(ISBLANK('8-Process Controls'!S228),\"\",'8-Process Controls'!S228)","v":""},{"$f":"IF(ISBLANK('8-Process Controls'!T228),\"\",'8-Process Controls'!T228)","v":""},null,null,null,null,null,null,null,null,null,null,null,null,null,{"$f":"IF(ISBLANK('8-Process Controls'!U228),\"\",'8-Process Controls'!U228)","v":""}]
[{"$f":"IF(ISBLANK('8-Process Controls'!C229),\"\",'8-Process Controls'!C229)","v":""},{"$f":"IF(ISBLANK('8-Process Controls'!D229),\"\",'8-Process Controls'!D229)","v":""},null,{"$f":"IF(ISBLANK('8-Process Controls'!E229),\"\",'8-Process Controls'!E229)","v":""},{"$f":"IF(ISBLANK('8-Process Controls'!F229),\"\",'8-Process Controls'!F229)","v":""},{"$f":"IF(ISBLANK('8-Process Controls'!G229),\"\",IF(LEFT('8-Process Controls'!G229,1)=\"Y\",\"PT\",\"\"))","v":""},null,{"$f":"IF(ISBLANK('8-Process Controls'!S229),\"\",'8-Process Controls'!S229)","v":""},{"$f":"IF(ISBLANK('8-Process Controls'!T229),\"\",'8-Process Controls'!T229)","v":""},null,null,null,null,null,null,null,null,null,null,null,null,null,{"$f":"IF(ISBLANK('8-Process Controls'!U229),\"\",'8-Process Controls'!U229)","v":""}]
[{"$f":"IF(ISBLANK('8-Process Controls'!C230),\"\",'8-Process Controls'!C230)","v":""},{"$f":"IF(ISBLANK('8-Process Controls'!D230),\"\",'8-Process Controls'!D230)","v":""},null,{"$f":"IF(ISBLANK('8-Process Controls'!E230),\"\",'8-Process Controls'!E230)","v":""},{"$f":"IF(ISBLANK('8-Process Controls'!F230),\"\",'8-Process Controls'!F230)","v":""},{"$f":"IF(ISBLANK('8-Process Controls'!G230),\"\",IF(LEFT('8-Process Controls'!G230,1)=\"Y\",\"PT\",\"\"))","v":""},null,{"$f":"IF(ISBLANK('8-Process Controls'!S230),\"\",'8-Process Controls'!S230)","v":""},{"$f":"IF(ISBLANK('8-Process Controls'!T230),\"\",'8-Process Controls'!T230)","v":""},null,null,null,null,null,null,null,null,null,null,null,null,null,{"$f":"IF(ISBLANK('8-Process Controls'!U230),\"\",'8-Process Controls'!U230)","v":""}]
[{"$f":"IF(ISBLANK('8-Process Controls'!C231),\"\",'8-Process Controls'!C231)","v":""},{"$f":"IF(ISBLANK('8-Process Controls'!D231),\"\",'8-Process Controls'!D231)","v":""},null,{"$f":"IF(ISBLANK('8-Process Controls'!E231),\"\",'8-Process Controls'!E231)","v":""},{"$f":"IF(ISBLANK('8-Process Controls'!F231),\"\",'8-Process Controls'!F231)","v":""},{"$f":"IF(ISBLANK('8-Process Controls'!G231),\"\",IF(LEFT('8-Process Controls'!G231,1)=\"Y\",\"PT\",\"\"))","v":""},null,{"$f":"IF(ISBLANK('8-Process Controls'!S231),\"\",'8-Process Controls'!S231)","v":""},{"$f":"IF(ISBLANK('8-Process Controls'!T231),\"\",'8-Process Controls'!T231)","v":""},null,null,null,null,null,null,null,null,null,null,null,null,null,{"$f":"IF(ISBLANK('8-Process Controls'!U231),\"\",'8-Process Controls'!U231)","v":""}]
[{"$f":"IF(ISBLANK('8-Process Controls'!C232),\"\",'8-Process Controls'!C232)","v":""},{"$f":"IF(ISBLANK('8-Process Controls'!D232),\"\",'8-Process Controls'!D232)","v":""},null,{"$f":"IF(ISBLANK('8-Process Controls'!E232),\"\",'8-Process Controls'!E232)","v":""},{"$f":"IF(ISBLANK('8-Process Controls'!F232),\"\",'8-Process Controls'!F232)","v":""},{"$f":"IF(ISBLANK('8-Process Controls'!G232),\"\",IF(LEFT('8-Process Controls'!G232,1)=\"Y\",\"PT\",\"\"))","v":""},null,{"$f":"IF(ISBLANK('8-Process Controls'!S232),\"\",'8-Process Controls'!S232)","v":""},{"$f":"IF(ISBLANK('8-Process Controls'!T232),\"\",'8-Process Controls'!T232)","v":""},null,null,null,null,null,null,null,null,null,null,null,null,null,{"$f":"IF(ISBLANK('8-Process Controls'!U232),\"\",'8-Process Controls'!U232)","v":""}]
[{"$f":"IF(ISBLANK('8-Process Controls'!C233),\"\",'8-Process Controls'!C233)","v":""},{"$f":"IF(ISBLANK('8-Process Controls'!D233),\"\",'8-Process Controls'!D233)","v":""},null,{"$f":"IF(ISBLANK('8-Process Controls'!E233),\"\",'8-Process Controls'!E233)","v":""},{"$f":"IF(ISBLANK('8-Process Controls'!F233),\"\",'8-Process Controls'!F233)","v":""},{"$f":"IF(ISBLANK('8-Process Controls'!G233),\"\",IF(LEFT('8-Process Controls'!G233,1)=\"Y\",\"PT\",\"\"))","v":""},null,{"$f":"IF(ISBLANK('8-Process Controls'!S233),\"\",'8-Process Controls'!S233)","v":""},{"$f":"IF(ISBLANK('8-Process Controls'!T233),\"\",'8-Process Controls'!T233)","v":""},null,null,null,null,null,null,null,null,null,null,null,null,null,{"$f":"IF(ISBLANK('8-Process Controls'!U233),\"\",'8-Process Controls'!U233)","v":""}]
[{"$f":"IF(ISBLANK('8-Process Controls'!C234),\"\",'8-Process Controls'!C234)","v":""},{"$f":"IF(ISBLANK('8-Process Controls'!D234),\"\",'8-Process Controls'!D234)","v":""},null,{"$f":"IF(ISBLANK('8-Process Controls'!E234),\"\",'8-Process Controls'!E234)","v":""},{"$f":"IF(ISBLANK('8-Process Controls'!F234),\"\",'8-Process Controls'!F234)","v":""},{"$f":"IF(ISBLANK('8-Process Controls'!G234),\"\",IF(LEFT('8-Process Controls'!G234,1)=\"Y\",\"PT\",\"\"))","v":""},null,{"$f":"IF(ISBLANK('8-Process Controls'!S234),\"\",'8-Process Controls'!S234)","v":""},{"$f":"IF(ISBLANK('8-Process Controls'!T234),\"\",'8-Process Controls'!T234)","v":""},null,null,null,null,null,null,null,null,null,null,null,null,null,{"$f":"IF(ISBLANK('8-Process Controls'!U234),\"\",'8-Process Controls'!U234)","v":""}]
[{"$f":"IF(ISBLANK('8-Process Controls'!C235),\"\",'8-Process Controls'!C235)","v":""},{"$f":"IF(ISBLANK('8-Process Controls'!D235),\"\",'8-Process Controls'!D235)","v":""},null,{"$f":"IF(ISBLANK('8-Process Controls'!E235),\"\",'8-Process Controls'!E235)","v":""},{"$f":"IF(ISBLANK('8-Process Controls'!F235),\"\",'8-Process Controls'!F235)","v":""},{"$f":"IF(ISBLANK('8-Process Controls'!G235),\"\",IF(LEFT('8-Process Controls'!G235,1)=\"Y\",\"PT\",\"\"))","v":""},null,{"$f":"IF(ISBLANK('8-Process Controls'!S235),\"\",'8-Process Controls'!S235)","v":""},{"$f":"IF(ISBLANK('8-Process Controls'!T235),\"\",'8-Process Controls'!T235)","v":""},null,null,null,null,null,null,null,null,null,null,null,null,null,{"$f":"IF(ISBLANK('8-Process Controls'!U235),\"\",'8-Process Controls'!U235)","v":""}]
[{"$f":"IF(ISBLANK('8-Process Controls'!C236),\"\",'8-Process Controls'!C236)","v":""},{"$f":"IF(ISBLANK('8-Process Controls'!D236),\"\",'8-Process Controls'!D236)","v":""},null,{"$f":"IF(ISBLANK('8-Process Controls'!E236),\"\",'8-Process Controls'!E236)","v":""},{"$f":"IF(ISBLANK('8-Process Controls'!F236),\"\",'8-Process Controls'!F236)","v":""},{"$f":"IF(ISBLANK('8-Process Controls'!G236),\"\",IF(LEFT('8-Process Controls'!G236,1)=\"Y\",\"PT\",\"\"))","v":""},null,{"$f":"IF(ISBLANK('8-Process Controls'!S236),\"\",'8-Process Controls'!S236)","v":""},{"$f":"IF(ISBLANK('8-Process Controls'!T236),\"\",'8-Process Controls'!T236)","v":""},null,null,null,null,null,null,null,null,null,null,null,null,null,{"$f":"IF(ISBLANK('8-Process Controls'!U236),\"\",'8-Process Controls'!U236)","v":""}]
[{"$f":"IF(ISBLANK('8-Process Controls'!C237),\"\",'8-Process Controls'!C237)","v":""},{"$f":"IF(ISBLANK('8-Process Controls'!D237),\"\",'8-Process Controls'!D237)","v":""},null,{"$f":"IF(ISBLANK('8-Process Controls'!E237),\"\",'8-Process Controls'!E237)","v":""},{"$f":"IF(ISBLANK('8-Process Controls'!F237),\"\",'8-Process Controls'!F237)","v":""},{"$f":"IF(ISBLANK('8-Process Controls'!G237),\"\",IF(LEFT('8-Process Controls'!G237,1)=\"Y\",\"PT\",\"\"))","v":""},null,{"$f":"IF(ISBLANK('8-Process Controls'!S237),\"\",'8-Process Controls'!S237)","v":""},{"$f":"IF(ISBLANK('8-Process Controls'!T237),\"\",'8-Process Controls'!T237)","v":""},null,null,null,null,null,null,null,null,null,null,null,null,null,{"$f":"IF(ISBLANK('8-Process Controls'!U237),\"\",'8-Process Controls'!U237)","v":""}]
[{"$f":"IF(ISBLANK('8-Process Controls'!C238),\"\",'8-Process Controls'!C238)","v":""},{"$f":"IF(ISBLANK('8-Process Controls'!D238),\"\",'8-Process Controls'!D238)","v":""},null,{"$f":"IF(ISBLANK('8-Process Controls'!E238),\"\",'8-Process Controls'!E238)","v":""},{"$f":"IF(ISBLANK('8-Process Controls'!F238),\"\",'8-Process Controls'!F238)","v":""},{"$f":"IF(ISBLANK('8-Process Controls'!G238),\"\",IF(LEFT('8-Process Controls'!G238,1)=\"Y\",\"PT\",\"\"))","v":""},null,{"$f":"IF(ISBLANK('8-Process Controls'!S238),\"\",'8-Process Controls'!S238)","v":""},{"$f":"IF(ISBLANK('8-Process Controls'!T238),\"\",'8-Process Controls'!T238)","v":""},null,null,null,null,null,null,null,null,null,null,null,null,null,{"$f":"IF(ISBLANK('8-Process Controls'!U238),\"\",'8-Process Controls'!U238)","v":""}]
[{"$f":"IF(ISBLANK('8-Process Controls'!C239),\"\",'8-Process Controls'!C239)","v":""},{"$f":"IF(ISBLANK('8-Process Controls'!D239),\"\",'8-Process Controls'!D239)","v":""},null,{"$f":"IF(ISBLANK('8-Process Controls'!E239),\"\",'8-Process Controls'!E239)","v":""},{"$f":"IF(ISBLANK('8-Process Controls'!F239),\"\",'8-Process Controls'!F239)","v":""},{"$f":"IF(ISBLANK('8-Process Controls'!G239),\"\",IF(LEFT('8-Process Controls'!G239,1)=\"Y\",\"PT\",\"\"))","v":""},null,{"$f":"IF(ISBLANK('8-Process Controls'!S239),\"\",'8-Process Controls'!S239)","v":""},{"$f":"IF(ISBLANK('8-Process Controls'!T239),\"\",'8-Process Controls'!T239)","v":""},null,null,null,null,null,null,null,null,null,null,null,null,null,{"$f":"IF(ISBLANK('8-Process Controls'!U239),\"\",'8-Process Controls'!U239)","v":""}]
[{"$f":"IF(ISBLANK('8-Process Controls'!C240),\"\",'8-Process Controls'!C240)","v":""},{"$f":"IF(ISBLANK('8-Process Controls'!D240),\"\",'8-Process Controls'!D240)","v":""},null,{"$f":"IF(ISBLANK('8-Process Controls'!E240),\"\",'8-Process Controls'!E240)","v":""},{"$f":"IF(ISBLANK('8-Process Controls'!F240),\"\",'8-Process Controls'!F240)","v":""},{"$f":"IF(ISBLANK('8-Process Controls'!G240),\"\",IF(LEFT('8-Process Controls'!G240,1)=\"Y\",\"PT\",\"\"))","v":""},null,{"$f":"IF(ISBLANK('8-Process Controls'!S240),\"\",'8-Process Controls'!S240)","v":""},{"$f":"IF(ISBLANK('8-Process Controls'!T240),\"\",'8-Process Controls'!T240)","v":""},null,null,null,null,null,null,null,null,null,null,null,null,null,{"$f":"IF(ISBLANK('8-Process Controls'!U240),\"\",'8-Process Controls'!U240)","v":""}]
[{"$f":"IF(ISBLANK('8-Process Controls'!C241),\"\",'8-Process Controls'!C241)","v":""},{"$f":"IF(ISBLANK('8-Process Controls'!D241),\"\",'8-Process Controls'!D241)","v":""},null,{"$f":"IF(ISBLANK('8-Process Controls'!E241),\"\",'8-Process Controls'!E241)","v":""},{"$f":"IF(ISBLANK('8-Process Controls'!F241),\"\",'8-Process Controls'!F241)","v":""},{"$f":"IF(ISBLANK('8-Process Controls'!G241),\"\",IF(LEFT('8-Process Controls'!G241,1)=\"Y\",\"PT\",\"\"))","v":""},null,{"$f":"IF(ISBLANK('8-Process Controls'!S241),\"\",'8-Process Controls'!S241)","v":""},{"$f":"IF(ISBLANK('8-Process Controls'!T241),\"\",'8-Process Controls'!T241)","v":""},null,null,null,null,null,null,null,null,null,null,null,null,null,{"$f":"IF(ISBLANK('8-Process Controls'!U241),\"\",'8-Process Controls'!U241)","v":""}]
[{"$f":"IF(ISBLANK('8-Process Controls'!C242),\"\",'8-Process Controls'!C242)","v":""},{"$f":"IF(ISBLANK('8-Process Controls'!D242),\"\",'8-Process Controls'!D242)","v":""},null,{"$f":"IF(ISBLANK('8-Process Controls'!E242),\"\",'8-Process Controls'!E242)","v":""},{"$f":"IF(ISBLANK('8-Process Controls'!F242),\"\",'8-Process Controls'!F242)","v":""},{"$f":"IF(ISBLANK('8-Process Controls'!G242),\"\",IF(LEFT('8-Process Controls'!G242,1)=\"Y\",\"PT\",\"\"))","v":""},null,{"$f":"IF(ISBLANK('8-Process Controls'!S242),\"\",'8-Process Controls'!S242)","v":""},{"$f":"IF(ISBLANK('8-Process Controls'!T242),\"\",'8-Process Controls'!T242)","v":""},null,null,null,null,null,null,null,null,null,null,null,null,null,{"$f":"IF(ISBLANK('8-Process Controls'!U242),\"\",'8-Process Controls'!U242)","v":""}]
[{"$f":"IF(ISBLANK('8-Process Controls'!C243),\"\",'8-Process Controls'!C243)","v":""},{"$f":"IF(ISBLANK('8-Process Controls'!D243),\"\",'8-Process Controls'!D243)","v":""},null,{"$f":"IF(ISBLANK('8-Process Controls'!E243),\"\",'8-Process Controls'!E243)","v":""},{"$f":"IF(ISBLANK('8-Process Controls'!F243),\"\",'8-Process Controls'!F243)","v":""},{"$f":"IF(ISBLANK('8-Process Controls'!G243),\"\",IF(LEFT('8-Process Controls'!G243,1)=\"Y\",\"PT\",\"\"))","v":""},null,{"$f":"IF(ISBLANK('8-Process Controls'!S243),\"\",'8-Process Controls'!S243)","v":""},{"$f":"IF(ISBLANK('8-Process Controls'!T243),\"\",'8-Process Controls'!T243)","v":""},null,null,null,null,null,null,null,null,null,null,null,null,null,{"$f":"IF(ISBLANK('8-Process Controls'!U243),\"\",'8-Process Controls'!U243)","v":""}]
[{"$f":"IF(ISBLANK('8-Process Controls'!C244),\"\",'8-Process Controls'!C244)","v":""},{"$f":"IF(ISBLANK('8-Process Controls'!D244),\"\",'8-Process Controls'!D244)","v":""},null,{"$f":"IF(ISBLANK('8-Process Controls'!E244),\"\",'8-Process Controls'!E244)","v":""},{"$f":"IF(ISBLANK('8-Process Controls'!F244),\"\",'8-Process Controls'!F244)","v":""},{"$f":"IF(ISBLANK('8-Process Controls'!G244),\"\",IF(LEFT('8-Process Controls'!G244,1)=\"Y\",\"PT\",\"\"))","v":""},null,{"$f":"IF(ISBLANK('8-Process Controls'!S244),\"\",'8-Process Controls'!S244)","v":""},{"$f":"IF(ISBLANK('8-Process Controls'!T244),\"\",'8-Process Controls'!T244)","v":""},null,null,null,null,null,null,null,null,null,null,null,null,null,{"$f":"IF(ISBLANK('8-Process Controls'!U244),\"\",'8-Process Controls'!U244)","v":""}]
[{"$f":"IF(ISBLANK('8-Process Controls'!C245),\"\",'8-Process Controls'!C245)","v":""},{"$f":"IF(ISBLANK('8-Process Controls'!D245),\"\",'8-Process Controls'!D245)","v":""},null,{"$f":"IF(ISBLANK('8-Process Controls'!E245),\"\",'8-Process Controls'!E245)","v":""},{"$f":"IF(ISBLANK('8-Process Controls'!F245),\"\",'8-Process Controls'!F245)","v":""},{"$f":"IF(ISBLANK('8-Process Controls'!G245),\"\",IF(LEFT('8-Process Controls'!G245,1)=\"Y\",\"PT\",\"\"))","v":""},null,{"$f":"IF(ISBLANK('8-Process Controls'!S245),\"\",'8-Process Controls'!S245)","v":""},{"$f":"IF(ISBLANK('8-Process Controls'!T245),\"\",'8-Process Controls'!T245)","v":""},null,null,null,null,null,null,null,null,null,null,null,null,null,{"$f":"IF(ISBLANK('8-Process Controls'!U245),\"\",'8-Process Controls'!U245)","v":""}]
[{"$f":"IF(ISBLANK('8-Process Controls'!C246),\"\",'8-Process Controls'!C246)","v":""},{"$f":"IF(ISBLANK('8-Process Controls'!D246),\"\",'8-Process Controls'!D246)","v":""},null,{"$f":"IF(ISBLANK('8-Process Controls'!E246),\"\",'8-Process Controls'!E246)","v":""},{"$f":"IF(ISBLANK('8-Process Controls'!F246),\"\",'8-Process Controls'!F246)","v":""},{"$f":"IF(ISBLANK('8-Process Controls'!G246),\"\",IF(LEFT('8-Process Controls'!G246,1)=\"Y\",\"PT\",\"\"))","v":""},null,{"$f":"IF(ISBLANK('8-Process Controls'!S246),\"\",'8-Process Controls'!S246)","v":""},{"$f":"IF(ISBLANK('8-Process Controls'!T246),\"\",'8-Process Controls'!T246)","v":""},null,null,null,null,null,null,null,null,null,null,null,null,null,{"$f":"IF(ISBLANK('8-Process Controls'!U246),\"\",'8-Process Controls'!U246)","v":""}]
[{"$f":"IF(ISBLANK('8-Process Controls'!C247),\"\",'8-Process Controls'!C247)","v":""},{"$f":"IF(ISBLANK('8-Process Controls'!D247),\"\",'8-Process Controls'!D247)","v":""},null,{"$f":"IF(ISBLANK('8-Process Controls'!E247),\"\",'8-Process Controls'!E247)","v":""},{"$f":"IF(ISBLANK('8-Process Controls'!F247),\"\",'8-Process Controls'!F247)","v":""},{"$f":"IF(ISBLANK('8-Process Controls'!G247),\"\",IF(LEFT('8-Process Controls'!G247,1)=\"Y\",\"PT\",\"\"))","v":""},null,{"$f":"IF(ISBLANK('8-Process Controls'!S247),\"\",'8-Process Controls'!S247)","v":""},{"$f":"IF(ISBLANK('8-Process Controls'!T247),\"\",'8-Process Controls'!T247)","v":""},null,null,null,null,null,null,null,null,null,null,null,null,null,{"$f":"IF(ISBLANK('8-Process Controls'!U247),\"\",'8-Process Controls'!U247)","v":""}]
[{"$f":"IF(ISBLANK('8-Process Controls'!C248),\"\",'8-Process Controls'!C248)","v":""},{"$f":"IF(ISBLANK('8-Process Controls'!D248),\"\",'8-Process Controls'!D248)","v":""},null,{"$f":"IF(ISBLANK('8-Process Controls'!E248),\"\",'8-Process Controls'!E248)","v":""},{"$f":"IF(ISBLANK('8-Process Controls'!F248),\"\",'8-Process Controls'!F248)","v":""},{"$f":"IF(ISBLANK('8-Process Controls'!G248),\"\",IF(LEFT('8-Process Controls'!G248,1)=\"Y\",\"PT\",\"\"))","v":""},null,{"$f":"IF(ISBLANK('8-Process Controls'!S248),\"\",'8-Process Controls'!S248)","v":""},{"$f":"IF(ISBLANK('8-Process Controls'!T248),\"\",'8-Process Controls'!T248)","v":""},null,null,null,null,null,null,null,null,null,null,null,null,null,{"$f":"IF(ISBLANK('8-Process Controls'!U248),\"\",'8-Process Controls'!U248)","v":""}]
[{"$f":"IF(ISBLANK('8-Process Controls'!C249),\"\",'8-Process Controls'!C249)","v":""},{"$f":"IF(ISBLANK('8-Process Controls'!D249),\"\",'8-Process Controls'!D249)","v":""},null,{"$f":"IF(ISBLANK('8-Process Controls'!E249),\"\",'8-Process Controls'!E249)","v":""},{"$f":"IF(ISBLANK('8-Process Controls'!F249),\"\",'8-Process Controls'!F249)","v":""},{"$f":"IF(ISBLANK('8-Process Controls'!G249),\"\",IF(LEFT('8-Process Controls'!G249,1)=\"Y\",\"PT\",\"\"))","v":""},null,{"$f":"IF(ISBLANK('8-Process Controls'!S249),\"\",'8-Process Controls'!S249)","v":""},{"$f":"IF(ISBLANK('8-Process Controls'!T249),\"\",'8-Process Controls'!T249)","v":""},null,null,null,null,null,null,null,null,null,null,null,null,null,{"$f":"IF(ISBLANK('8-Process Controls'!U249),\"\",'8-Process Controls'!U249)","v":""}]
[{"$f":"IF(ISBLANK('8-Process Controls'!C250),\"\",'8-Process Controls'!C250)","v":""},{"$f":"IF(ISBLANK('8-Process Controls'!D250),\"\",'8-Process Controls'!D250)","v":""},null,{"$f":"IF(ISBLANK('8-Process Controls'!E250),\"\",'8-Process Controls'!E250)","v":""},{"$f":"IF(ISBLANK('8-Process Controls'!F250),\"\",'8-Process Controls'!F250)","v":""},{"$f":"IF(ISBLANK('8-Process Controls'!G250),\"\",IF(LEFT('8-Process Controls'!G250,1)=\"Y\",\"PT\",\"\"))","v":""},null,{"$f":"IF(ISBLANK('8-Process Controls'!S250),\"\",'8-Process Controls'!S250)","v":""},{"$f":"IF(ISBLANK('8-Process Controls'!T250),\"\",'8-Process Controls'!T250)","v":""},null,null,null,null,null,null,null,null,null,null,null,null,null,{"$f":"IF(ISBLANK('8-Process Controls'!U250),\"\",'8-Process Controls'!U250)","v":""}]
[{"$f":"IF(ISBLANK('8-Process Controls'!C251),\"\",'8-Process Controls'!C251)","v":""},{"$f":"IF(ISBLANK('8-Process Controls'!D251),\"\",'8-Process Controls'!D251)","v":""},null,{"$f":"IF(ISBLANK('8-Process Controls'!E251),\"\",'8-Process Controls'!E251)","v":""},{"$f":"IF(ISBLANK('8-Process Controls'!F251),\"\",'8-Process Controls'!F251)","v":""},{"$f":"IF(ISBLANK('8-Process Controls'!G251),\"\",IF(LEFT('8-Process Controls'!G251,1)=\"Y\",\"PT\",\"\"))","v":""},null,{"$f":"IF(ISBLANK('8-Process Controls'!S251),\"\",'8-Process Controls'!S251)","v":""},{"$f":"IF(ISBLANK('8-Process Controls'!T251),\"\",'8-Process Controls'!T251)","v":""},null,null,null,null,null,null,null,null,null,null,null,null,null,{"$f":"IF(ISBLANK('8-Process Controls'!U251),\"\",'8-Process Controls'!U251)","v":""}]
[{"$f":"IF(ISBLANK('8-Process Controls'!C252),\"\",'8-Process Controls'!C252)","v":""},{"$f":"IF(ISBLANK('8-Process Controls'!D252),\"\",'8-Process Controls'!D252)","v":""},null,{"$f":"IF(ISBLANK('8-Process Controls'!E252),\"\",'8-Process Controls'!E252)","v":""},{"$f":"IF(ISBLANK('8-Process Controls'!F252),\"\",'8-Process Controls'!F252)","v":""},{"$f":"IF(ISBLANK('8-Process Controls'!G252),\"\",IF(LEFT('8-Process Controls'!G252,1)=\"Y\",\"PT\",\"\"))","v":""},null,{"$f":"IF(ISBLANK('8-Process Controls'!S252),\"\",'8-Process Controls'!S252)","v":""},{"$f":"IF(ISBLANK('8-Process Controls'!T252),\"\",'8-Process Controls'!T252)","v":""},null,null,null,null,null,null,null,null,null,null,null,null,null,{"$f":"IF(ISBLANK('8-Process Controls'!U252),\"\",'8-Process Controls'!U252)","v":""}]
[{"$f":"IF(ISBLANK('8-Process Controls'!C253),\"\",'8-Process Controls'!C253)","v":""},{"$f":"IF(ISBLANK('8-Process Controls'!D253),\"\",'8-Process Controls'!D253)","v":""},null,{"$f":"IF(ISBLANK('8-Process Controls'!E253),\"\",'8-Process Controls'!E253)","v":""},{"$f":"IF(ISBLANK('8-Process Controls'!F253),\"\",'8-Process Controls'!F253)","v":""},{"$f":"IF(ISBLANK('8-Process Controls'!G253),\"\",IF(LEFT('8-Process Controls'!G253,1)=\"Y\",\"PT\",\"\"))","v":""},null,{"$f":"IF(ISBLANK('8-Process Controls'!S253),\"\",'8-Process Controls'!S253)","v":""},{"$f":"IF(ISBLANK('8-Process Controls'!T253),\"\",'8-Process Controls'!T253)","v":""},null,null,null,null,null,null,null,null,null,null,null,null,null,{"$f":"IF(ISBLANK('8-Process Controls'!U253),\"\",'8-Process Controls'!U253)","v":""}]
[{"$f":"IF(ISBLANK('8-Process Controls'!C254),\"\",'8-Process Controls'!C254)","v":""},{"$f":"IF(ISBLANK('8-Process Controls'!D254),\"\",'8-Process Controls'!D254)","v":""},null,{"$f":"IF(ISBLANK('8-Process Controls'!E254),\"\",'8-Process Controls'!E254)","v":""},{"$f":"IF(ISBLANK('8-Process Controls'!F254),\"\",'8-Process Controls'!F254)","v":""},{"$f":"IF(ISBLANK('8-Process Controls'!G254),\"\",IF(LEFT('8-Process Controls'!G254,1)=\"Y\",\"PT\",\"\"))","v":""},null,{"$f":"IF(ISBLANK('8-Process Controls'!S254),\"\",'8-Process Controls'!S254)","v":""},{"$f":"IF(ISBLANK('8-Process Controls'!T254),\"\",'8-Process Controls'!T254)","v":""},null,null,null,null,null,null,null,null,null,null,null,null,null,{"$f":"IF(ISBLANK('8-Process Controls'!U254),\"\",'8-Process Controls'!U254)","v":""}]
[{"$f":"IF(ISBLANK('8-Process Controls'!C255),\"\",'8-Process Controls'!C255)","v":""},{"$f":"IF(ISBLANK('8-Process Controls'!D255),\"\",'8-Process Controls'!D255)","v":""},null,{"$f":"IF(ISBLANK('8-Process Controls'!E255),\"\",'8-Process Controls'!E255)","v":""},{"$f":"IF(ISBLANK('8-Process Controls'!F255),\"\",'8-Process Controls'!F255)","v":""},{"$f":"IF(ISBLANK('8-Process Controls'!G255),\"\",IF(LEFT('8-Process Controls'!G255,1)=\"Y\",\"PT\",\"\"))","v":""},null,{"$f":"IF(ISBLANK('8-Process Controls'!S255),\"\",'8-Process Controls'!S255)","v":""},{"$f":"IF(ISBLANK('8-Process Controls'!T255),\"\",'8-Process Controls'!T255)","v":""},null,null,null,null,null,null,null,null,null,null,null,null,null,{"$f":"IF(ISBLANK('8-Process Controls'!U255),\"\",'8-Process Controls'!U255)","v":""}]
[{"$f":"IF(ISBLANK('8-Process Controls'!C256),\"\",'8-Process Controls'!C256)","v":""},{"$f":"IF(ISBLANK('8-Process Controls'!D256),\"\",'8-Process Controls'!D256)","v":""},null,{"$f":"IF(ISBLANK('8-Process Controls'!E256),\"\",'8-Process Controls'!E256)","v":""},{"$f":"IF(ISBLANK('8-Process Controls'!F256),\"\",'8-Process Controls'!F256)","v":""},{"$f":"IF(ISBLANK('8-Process Controls'!G256),\"\",IF(LEFT('8-Process Controls'!G256,1)=\"Y\",\"PT\",\"\"))","v":""},null,{"$f":"IF(ISBLANK('8-Process Controls'!S256),\"\",'8-Process Controls'!S256)","v":""},{"$f":"IF(ISBLANK('8-Process Controls'!T256),\"\",'8-Process Controls'!T256)","v":""},null,null,null,null,null,null,null,null,null,null,null,null,null,{"$f":"IF(ISBLANK('8-Process Controls'!U256),\"\",'8-Process Controls'!U256)","v":""}]
[{"$f":"IF(ISBLANK('8-Process Controls'!C257),\"\",'8-Process Controls'!C257)","v":""},{"$f":"IF(ISBLANK('8-Process Controls'!D257),\"\",'8-Process Controls'!D257)","v":""},null,{"$f":"IF(ISBLANK('8-Process Controls'!E257),\"\",'8-Process Controls'!E257)","v":""},{"$f":"IF(ISBLANK('8-Process Controls'!F257),\"\",'8-Process Controls'!F257)","v":""},{"$f":"IF(ISBLANK('8-Process Controls'!G257),\"\",IF(LEFT('8-Process Controls'!G257,1)=\"Y\",\"PT\",\"\"))","v":""},null,{"$f":"IF(ISBLANK('8-Process Controls'!S257),\"\",'8-Process Controls'!S257)","v":""},{"$f":"IF(ISBLANK('8-Process Controls'!T257),\"\",'8-Process Controls'!T257)","v":""},null,null,null,null,null,null,null,null,null,null,null,null,null,{"$f":"IF(ISBLANK('8-Process Controls'!U257),\"\",'8-Process Controls'!U257)","v":""}]
[{"$f":"IF(ISBLANK('8-Process Controls'!C258),\"\",'8-Process Controls'!C258)","v":""},{"$f":"IF(ISBLANK('8-Process Controls'!D258),\"\",'8-Process Controls'!D258)","v":""},null,{"$f":"IF(ISBLANK('8-Process Controls'!E258),\"\",'8-Process Controls'!E258)","v":""},{"$f":"IF(ISBLANK('8-Process Controls'!F258),\"\",'8-Process Controls'!F258)","v":""},{"$f":"IF(ISBLANK('8-Process Controls'!G258),\"\",IF(LEFT('8-Process Controls'!G258,1)=\"Y\",\"PT\",\"\"))","v":""},null,{"$f":"IF(ISBLANK('8-Process Controls'!S258),\"\",'8-Process Controls'!S258)","v":""},{"$f":"IF(ISBLANK('8-Process Controls'!T258),\"\",'8-Process Controls'!T258)","v":""},null,null,null,null,null,null,null,null,null,null,null,null,null,{"$f":"IF(ISBLANK('8-Process Controls'!U258),\"\",'8-Process Controls'!U258)","v":""}]
[{"$f":"IF(ISBLANK('8-Process Controls'!C259),\"\",'8-Process Controls'!C259)","v":""},{"$f":"IF(ISBLANK('8-Process Controls'!D259),\"\",'8-Process Controls'!D259)","v":""},null,{"$f":"IF(ISBLANK('8-Process Controls'!E259),\"\",'8-Process Controls'!E259)","v":""},{"$f":"IF(ISBLANK('8-Process Controls'!F259),\"\",'8-Process Controls'!F259)","v":""},{"$f":"IF(ISBLANK('8-Process Controls'!G259),\"\",IF(LEFT('8-Process Controls'!G259,1)=\"Y\",\"PT\",\"\"))","v":""},null,{"$f":"IF(ISBLANK('8-Process Controls'!S259),\"\",'8-Process Controls'!S259)","v":""},{"$f":"IF(ISBLANK('8-Process Controls'!T259),\"\",'8-Process Controls'!T259)","v":""},null,null,null,null,null,null,null,null,null,null,null,null,null,{"$f":"IF(ISBLANK('8-Process Controls'!U259),\"\",'8-Process Controls'!U259)","v":""}]
[{"$f":"IF(ISBLANK('8-Process Controls'!C260),\"\",'8-Process Controls'!C260)","v":""},{"$f":"IF(ISBLANK('8-Process Controls'!D260),\"\",'8-Process Controls'!D260)","v":""},null,{"$f":"IF(ISBLANK('8-Process Controls'!E260),\"\",'8-Process Controls'!E260)","v":""},{"$f":"IF(ISBLANK('8-Process Controls'!F260),\"\",'8-Process Controls'!F260)","v":""},{"$f":"IF(ISBLANK('8-Process Controls'!G260),\"\",IF(LEFT('8-Process Controls'!G260,1)=\"Y\",\"PT\",\"\"))","v":""},null,{"$f":"IF(ISBLANK('8-Process Controls'!S260),\"\",'8-Process Controls'!S260)","v":""},{"$f":"IF(ISBLANK('8-Process Controls'!T260),\"\",'8-Process Controls'!T260)","v":""},null,null,null,null,null,null,null,null,null,null,null,null,null,{"$f":"IF(ISBLANK('8-Process Controls'!U260),\"\",'8-Process Controls'!U260)","v":""}]
[{"$f":"IF(ISBLANK('8-Process Controls'!C261),\"\",'8-Process Controls'!C261)","v":""},{"$f":"IF(ISBLANK('8-Process Controls'!D261),\"\",'8-Process Controls'!D261)","v":""},null,{"$f":"IF(ISBLANK('8-Process Controls'!E261),\"\",'8-Process Controls'!E261)","v":""},{"$f":"IF(ISBLANK('8-Process Controls'!F261),\"\",'8-Process Controls'!F261)","v":""},{"$f":"IF(ISBLANK('8-Process Controls'!G261),\"\",IF(LEFT('8-Process Controls'!G261,1)=\"Y\",\"PT\",\"\"))","v":""},null,{"$f":"IF(ISBLANK('8-Process Controls'!S261),\"\",'8-Process Controls'!S261)","v":""},{"$f":"IF(ISBLANK('8-Process Controls'!T261),\"\",'8-Process Controls'!T261)","v":""},null,null,null,null,null,null,null,null,null,null,null,null,null,{"$f":"IF(ISBLANK('8-Process Controls'!U261),\"\",'8-Process Controls'!U261)","v":""}]
[{"$f":"IF(ISBLANK('8-Process Controls'!C262),\"\",'8-Process Controls'!C262)","v":""},{"$f":"IF(ISBLANK('8-Process Controls'!D262),\"\",'8-Process Controls'!D262)","v":""},null,{"$f":"IF(ISBLANK('8-Process Controls'!E262),\"\",'8-Process Controls'!E262)","v":""},{"$f":"IF(ISBLANK('8-Process Controls'!F262),\"\",'8-Process Controls'!F262)","v":""},{"$f":"IF(ISBLANK('8-Process Controls'!G262),\"\",IF(LEFT('8-Process Controls'!G262,1)=\"Y\",\"PT\",\"\"))","v":""},null,{"$f":"IF(ISBLANK('8-Process Controls'!S262),\"\",'8-Process Controls'!S262)","v":""},{"$f":"IF(ISBLANK('8-Process Controls'!T262),\"\",'8-Process Controls'!T262)","v":""},null,null,null,null,null,null,null,null,null,null,null,null,null,{"$f":"IF(ISBLANK('8-Process Controls'!U262),\"\",'8-Process Controls'!U262)","v":""}]
[{"$f":"IF(ISBLANK('8-Process Controls'!C263),\"\",'8-Process Controls'!C263)","v":""},{"$f":"IF(ISBLANK('8-Process Controls'!D263),\"\",'8-Process Controls'!D263)","v":""},null,{"$f":"IF(ISBLANK('8-Process Controls'!E263),\"\",'8-Process Controls'!E263)","v":""},{"$f":"IF(ISBLANK('8-Process Controls'!F263),\"\",'8-Process Controls'!F263)","v":""},{"$f":"IF(ISBLANK('8-Process Controls'!G263),\"\",IF(LEFT('8-Process Controls'!G263,1)=\"Y\",\"PT\",\"\"))","v":""},null,{"$f":"IF(ISBLANK('8-Process Controls'!S263),\"\",'8-Process Controls'!S263)","v":""},{"$f":"IF(ISBLANK('8-Process Controls'!T263),\"\",'8-Process Controls'!T263)","v":""},null,null,null,null,null,null,null,null,null,null,null,null,null,{"$f":"IF(ISBLANK('8-Process Controls'!U263),\"\",'8-Process Controls'!U263)","v":""}]
[{"$f":"IF(ISBLANK('8-Process Controls'!C264),\"\",'8-Process Controls'!C264)","v":""},{"$f":"IF(ISBLANK('8-Process Controls'!D264),\"\",'8-Process Controls'!D264)","v":""},null,{"$f":"IF(ISBLANK('8-Process Controls'!E264),\"\",'8-Process Controls'!E264)","v":""},{"$f":"IF(ISBLANK('8-Process Controls'!F264),\"\",'8-Process Controls'!F264)","v":""},{"$f":"IF(ISBLANK('8-Process Controls'!G264),\"\",IF(LEFT('8-Process Controls'!G264,1)=\"Y\",\"PT\",\"\"))","v":""},null,{"$f":"IF(ISBLANK('8-Process Controls'!S264),\"\",'8-Process Controls'!S264)","v":""},{"$f":"IF(ISBLANK('8-Process Controls'!T264),\"\",'8-Process Controls'!T264)","v":""},null,null,null,null,null,null,null,null,null,null,null,null,null,{"$f":"IF(ISBLANK('8-Process Controls'!U264),\"\",'8-Process Controls'!U264)","v":""}]
[{"$f":"IF(ISBLANK('8-Process Controls'!C265),\"\",'8-Process Controls'!C265)","v":""},{"$f":"IF(ISBLANK('8-Process Controls'!D265),\"\",'8-Process Controls'!D265)","v":""},null,{"$f":"IF(ISBLANK('8-Process Controls'!E265),\"\",'8-Process Controls'!E265)","v":""},{"$f":"IF(ISBLANK('8-Process Controls'!F265),\"\",'8-Process Controls'!F265)","v":""},{"$f":"IF(ISBLANK('8-Process Controls'!G265),\"\",IF(LEFT('8-Process Controls'!G265,1)=\"Y\",\"PT\",\"\"))","v":""},null,{"$f":"IF(ISBLANK('8-Process Controls'!S265),\"\",'8-Process Controls'!S265)","v":""},{"$f":"IF(ISBLANK('8-Process Controls'!T265),\"\",'8-Process Controls'!T265)","v":""},null,null,null,null,null,null,null,null,null,null,null,null,null,{"$f":"IF(ISBLANK('8-Process Controls'!U265),\"\",'8-Process Controls'!U265)","v":""}]
[{"$f":"IF(ISBLANK('8-Process Controls'!C266),\"\",'8-Process Controls'!C266)","v":""},{"$f":"IF(ISBLANK('8-Process Controls'!D266),\"\",'8-Process Controls'!D266)","v":""},null,{"$f":"IF(ISBLANK('8-Process Controls'!E266),\"\",'8-Process Controls'!E266)","v":""},{"$f":"IF(ISBLANK('8-Process Controls'!F266),\"\",'8-Process Controls'!F266)","v":""},{"$f":"IF(ISBLANK('8-Process Controls'!G266),\"\",IF(LEFT('8-Process Controls'!G266,1)=\"Y\",\"PT\",\"\"))","v":""},null,{"$f":"IF(ISBLANK('8-Process Controls'!S266),\"\",'8-Process Controls'!S266)","v":""},{"$f":"IF(ISBLANK('8-Process Controls'!T266),\"\",'8-Process Controls'!T266)","v":""},null,null,null,null,null,null,null,null,null,null,null,null,null,{"$f":"IF(ISBLANK('8-Process Controls'!U266),\"\",'8-Process Controls'!U266)","v":""}]
[{"$f":"IF(ISBLANK('8-Process Controls'!C267),\"\",'8-Process Controls'!C267)","v":""},{"$f":"IF(ISBLANK('8-Process Controls'!D267),\"\",'8-Process Controls'!D267)","v":""},null,{"$f":"IF(ISBLANK('8-Process Controls'!E267),\"\",'8-Process Controls'!E267)","v":""},{"$f":"IF(ISBLANK('8-Process Controls'!F267),\"\",'8-Process Controls'!F267)","v":""},{"$f":"IF(ISBLANK('8-Process Controls'!G267),\"\",IF(LEFT('8-Process Controls'!G267,1)=\"Y\",\"PT\",\"\"))","v":""},null,{"$f":"IF(ISBLANK('8-Process Controls'!S267),\"\",'8-Process Controls'!S267)","v":""},{"$f":"IF(ISBLANK('8-Process Controls'!T267),\"\",'8-Process Controls'!T267)","v":""},null,null,null,null,null,null,null,null,null,null,null,null,null,{"$f":"IF(ISBLANK('8-Process Controls'!U267),\"\",'8-Process Controls'!U267)","v":""}]
[{"$f":"IF(ISBLANK('8-Process Controls'!C268),\"\",'8-Process Controls'!C268)","v":""},{"$f":"IF(ISBLANK('8-Process Controls'!D268),\"\",'8-Process Controls'!D268)","v":""},null,{"$f":"IF(ISBLANK('8-Process Controls'!E268),\"\",'8-Process Controls'!E268)","v":""},{"$f":"IF(ISBLANK('8-Process Controls'!F268),\"\",'8-Process Controls'!F268)","v":""},{"$f":"IF(ISBLANK('8-Process Controls'!G268),\"\",IF(LEFT('8-Process Controls'!G268,1)=\"Y\",\"PT\",\"\"))","v":""},null,{"$f":"IF(ISBLANK('8-Process Controls'!S268),\"\",'8-Process Controls'!S268)","v":""},{"$f":"IF(ISBLANK('8-Process Controls'!T268),\"\",'8-Process Controls'!T268)","v":""},null,null,null,null,null,null,null,null,null,null,null,null,null,{"$f":"IF(ISBLANK('8-Process Controls'!U268),\"\",'8-Process Controls'!U268)","v":""}]
[{"$f":"IF(ISBLANK('8-Process Controls'!C269),\"\",'8-Process Controls'!C269)","v":""},{"$f":"IF(ISBLANK('8-Process Controls'!D269),\"\",'8-Process Controls'!D269)","v":""},null,{"$f":"IF(ISBLANK('8-Process Controls'!E269),\"\",'8-Process Controls'!E269)","v":""},{"$f":"IF(ISBLANK('8-Process Controls'!F269),\"\",'8-Process Controls'!F269)","v":""},{"$f":"IF(ISBLANK('8-Process Controls'!G269),\"\",IF(LEFT('8-Process Controls'!G269,1)=\"Y\",\"PT\",\"\"))","v":""},null,{"$f":"IF(ISBLANK('8-Process Controls'!S269),\"\",'8-Process Controls'!S269)","v":""},{"$f":"IF(ISBLANK('8-Process Controls'!T269),\"\",'8-Process Controls'!T269)","v":""},null,null,null,null,null,null,null,null,null,null,null,null,null,{"$f":"IF(ISBLANK('8-Process Controls'!U269),\"\",'8-Process Controls'!U269)","v":""}]
[{"$f":"IF(ISBLANK('8-Process Controls'!C270),\"\",'8-Process Controls'!C270)","v":""},{"$f":"IF(ISBLANK('8-Process Controls'!D270),\"\",'8-Process Controls'!D270)","v":""},null,{"$f":"IF(ISBLANK('8-Process Controls'!E270),\"\",'8-Process Controls'!E270)","v":""},{"$f":"IF(ISBLANK('8-Process Controls'!F270),\"\",'8-Process Controls'!F270)","v":""},{"$f":"IF(ISBLANK('8-Process Controls'!G270),\"\",IF(LEFT('8-Process Controls'!G270,1)=\"Y\",\"PT\",\"\"))","v":""},null,{"$f":"IF(ISBLANK('8-Process Controls'!S270),\"\",'8-Process Controls'!S270)","v":""},{"$f":"IF(ISBLANK('8-Process Controls'!T270),\"\",'8-Process Controls'!T270)","v":""},null,null,null,null,null,null,null,null,null,null,null,null,null,{"$f":"IF(ISBLANK('8-Process Controls'!U270),\"\",'8-Process Controls'!U270)","v":""}]
[{"$f":"IF(ISBLANK('8-Process Controls'!C271),\"\",'8-Process Controls'!C271)","v":""},{"$f":"IF(ISBLANK('8-Process Controls'!D271),\"\",'8-Process Controls'!D271)","v":""},null,{"$f":"IF(ISBLANK('8-Process Controls'!E271),\"\",'8-Process Controls'!E271)","v":""},{"$f":"IF(ISBLANK('8-Process Controls'!F271),\"\",'8-Process Controls'!F271)","v":""},{"$f":"IF(ISBLANK('8-Process Controls'!G271),\"\",IF(LEFT('8-Process Controls'!G271,1)=\"Y\",\"PT\",\"\"))","v":""},null,{"$f":"IF(ISBLANK('8-Process Controls'!S271),\"\",'8-Process Controls'!S271)","v":""},{"$f":"IF(ISBLANK('8-Process Controls'!T271),\"\",'8-Process Controls'!T271)","v":""},null,null,null,null,null,null,null,null,null,null,null,null,null,{"$f":"IF(ISBLANK('8-Process Controls'!U271),\"\",'8-Process Controls'!U271)","v":""}]
[{"$f":"IF(ISBLANK('8-Process Controls'!C272),\"\",'8-Process Controls'!C272)","v":""},{"$f":"IF(ISBLANK('8-Process Controls'!D272),\"\",'8-Process Controls'!D272)","v":""},null,{"$f":"IF(ISBLANK('8-Process Controls'!E272),\"\",'8-Process Controls'!E272)","v":""},{"$f":"IF(ISBLANK('8-Process Controls'!F272),\"\",'8-Process Controls'!F272)","v":""},{"$f":"IF(ISBLANK('8-Process Controls'!G272),\"\",IF(LEFT('8-Process Controls'!G272,1)=\"Y\",\"PT\",\"\"))","v":""},null,{"$f":"IF(ISBLANK('8-Process Controls'!S272),\"\",'8-Process Controls'!S272)","v":""},{"$f":"IF(ISBLANK('8-Process Controls'!T272),\"\",'8-Process Controls'!T272)","v":""},null,null,null,null,null,null,null,null,null,null,null,null,null,{"$f":"IF(ISBLANK('8-Process Controls'!U272),\"\",'8-Process Controls'!U272)","v":""}]
[{"$f":"IF(ISBLANK('8-Process Controls'!C273),\"\",'8-Process Controls'!C273)","v":""},{"$f":"IF(ISBLANK('8-Process Controls'!D273),\"\",'8-Process Controls'!D273)","v":""},null,{"$f":"IF(ISBLANK('8-Process Controls'!E273),\"\",'8-Process Controls'!E273)","v":""},{"$f":"IF(ISBLANK('8-Process Controls'!F273),\"\",'8-Process Controls'!F273)","v":""},{"$f":"IF(ISBLANK('8-Process Controls'!G273),\"\",IF(LEFT('8-Process Controls'!G273,1)=\"Y\",\"PT\",\"\"))","v":""},null,{"$f":"IF(ISBLANK('8-Process Controls'!S273),\"\",'8-Process Controls'!S273)","v":""},{"$f":"IF(ISBLANK('8-Process Controls'!T273),\"\",'8-Process Controls'!T273)","v":""},null,null,null,null,null,null,null,null,null,null,null,null,null,{"$f":"IF(ISBLANK('8-Process Controls'!U273),\"\",'8-Process Controls'!U273)","v":""}]
[{"$f":"IF(ISBLANK('8-Process Controls'!C274),\"\",'8-Process Controls'!C274)","v":""},{"$f":"IF(ISBLANK('8-Process Controls'!D274),\"\",'8-Process Controls'!D274)","v":""},null,{"$f":"IF(ISBLANK('8-Process Controls'!E274),\"\",'8-Process Controls'!E274)","v":""},{"$f":"IF(ISBLANK('8-Process Controls'!F274),\"\",'8-Process Controls'!F274)","v":""},{"$f":"IF(ISBLANK('8-Process Controls'!G274),\"\",IF(LEFT('8-Process Controls'!G274,1)=\"Y\",\"PT\",\"\"))","v":""},null,{"$f":"IF(ISBLANK('8-Process Controls'!S274),\"\",'8-Process Controls'!S274)","v":""},{"$f":"IF(ISBLANK('8-Process Controls'!T274),\"\",'8-Process Controls'!T274)","v":""},null,null,null,null,null,null,null,null,null,null,null,null,null,{"$f":"IF(ISBLANK('8-Process Controls'!U274),\"\",'8-Process Controls'!U274)","v":""}]
[{"$f":"IF(ISBLANK('8-Process Controls'!C275),\"\",'8-Process Controls'!C275)","v":""},{"$f":"IF(ISBLANK('8-Process Controls'!D275),\"\",'8-Process Controls'!D275)","v":""},null,{"$f":"IF(ISBLANK('8-Process Controls'!E275),\"\",'8-Process Controls'!E275)","v":""},{"$f":"IF(ISBLANK('8-Process Controls'!F275),\"\",'8-Process Controls'!F275)","v":""},{"$f":"IF(ISBLANK('8-Process Controls'!G275),\"\",IF(LEFT('8-Process Controls'!G275,1)=\"Y\",\"PT\",\"\"))","v":""},null,{"$f":"IF(ISBLANK('8-Process Controls'!S275),\"\",'8-Process Controls'!S275)","v":""},{"$f":"IF(ISBLANK('8-Process Controls'!T275),\"\",'8-Process Controls'!T275)","v":""},null,null,null,null,null,null,null,null,null,null,null,null,null,{"$f":"IF(ISBLANK('8-Process Controls'!U275),\"\",'8-Process Controls'!U275)","v":""}]
[{"$f":"IF(ISBLANK('8-Process Controls'!C276),\"\",'8-Process Controls'!C276)","v":""},{"$f":"IF(ISBLANK('8-Process Controls'!D276),\"\",'8-Process Controls'!D276)","v":""},null,{"$f":"IF(ISBLANK('8-Process Controls'!E276),\"\",'8-Process Controls'!E276)","v":""},{"$f":"IF(ISBLANK('8-Process Controls'!F276),\"\",'8-Process Controls'!F276)","v":""},{"$f":"IF(ISBLANK('8-Process Controls'!G276),\"\",IF(LEFT('8-Process Controls'!G276,1)=\"Y\",\"PT\",\"\"))","v":""},null,{"$f":"IF(ISBLANK('8-Process Controls'!S276),\"\",'8-Process Controls'!S276)","v":""},{"$f":"IF(ISBLANK('8-Process Controls'!T276),\"\",'8-Process Controls'!T276)","v":""},null,null,null,null,null,null,null,null,null,null,null,null,null,{"$f":"IF(ISBLANK('8-Process Controls'!U276),\"\",'8-Process Controls'!U276)","v":""}]
[{"$f":"IF(ISBLANK('8-Process Controls'!C277),\"\",'8-Process Controls'!C277)","v":""},{"$f":"IF(ISBLANK('8-Process Controls'!D277),\"\",'8-Process Controls'!D277)","v":""},null,{"$f":"IF(ISBLANK('8-Process Controls'!E277),\"\",'8-Process Controls'!E277)","v":""},{"$f":"IF(ISBLANK('8-Process Controls'!F277),\"\",'8-Process Controls'!F277)","v":""},{"$f":"IF(ISBLANK('8-Process Controls'!G277),\"\",IF(LEFT('8-Process Controls'!G277,1)=\"Y\",\"PT\",\"\"))","v":""},null,{"$f":"IF(ISBLANK('8-Process Controls'!S277),\"\",'8-Process Controls'!S277)","v":""},{"$f":"IF(ISBLANK('8-Process Controls'!T277),\"\",'8-Process Controls'!T277)","v":""},null,null,null,null,null,null,null,null,null,null,null,null,null,{"$f":"IF(ISBLANK('8-Process Controls'!U277),\"\",'8-Process Controls'!U277)","v":""}]
[{"$f":"IF(ISBLANK('8-Process Controls'!C278),\"\",'8-Process Controls'!C278)","v":""},{"$f":"IF(ISBLANK('8-Process Controls'!D278),\"\",'8-Process Controls'!D278)","v":""},null,{"$f":"IF(ISBLANK('8-Process Controls'!E278),\"\",'8-Process Controls'!E278)","v":""},{"$f":"IF(ISBLANK('8-Process Controls'!F278),\"\",'8-Process Controls'!F278)","v":""},{"$f":"IF(ISBLANK('8-Process Controls'!G278),\"\",IF(LEFT('8-Process Controls'!G278,1)=\"Y\",\"PT\",\"\"))","v":""},null,{"$f":"IF(ISBLANK('8-Process Controls'!S278),\"\",'8-Process Controls'!S278)","v":""},{"$f":"IF(ISBLANK('8-Process Controls'!T278),\"\",'8-Process Controls'!T278)","v":""},null,null,null,null,null,null,null,null,null,null,null,null,null,{"$f":"IF(ISBLANK('8-Process Controls'!U278),\"\",'8-Process Controls'!U278)","v":""}]
[{"$f":"IF(ISBLANK('8-Process Controls'!C279),\"\",'8-Process Controls'!C279)","v":""},{"$f":"IF(ISBLANK('8-Process Controls'!D279),\"\",'8-Process Controls'!D279)","v":""},null,{"$f":"IF(ISBLANK('8-Process Controls'!E279),\"\",'8-Process Controls'!E279)","v":""},{"$f":"IF(ISBLANK('8-Process Controls'!F279),\"\",'8-Process Controls'!F279)","v":""},{"$f":"IF(ISBLANK('8-Process Controls'!G279),\"\",IF(LEFT('8-Process Controls'!G279,1)=\"Y\",\"PT\",\"\"))","v":""},null,{"$f":"IF(ISBLANK('8-Process Controls'!S279),\"\",'8-Process Controls'!S279)","v":""},{"$f":"IF(ISBLANK('8-Process Controls'!T279),\"\",'8-Process Controls'!T279)","v":""},null,null,null,null,null,null,null,null,null,null,null,null,null,{"$f":"IF(ISBLANK('8-Process Controls'!U279),\"\",'8-Process Controls'!U279)","v":""}]
[{"$f":"IF(ISBLANK('8-Process Controls'!C280),\"\",'8-Process Controls'!C280)","v":""},{"$f":"IF(ISBLANK('8-Process Controls'!D280),\"\",'8-Process Controls'!D280)","v":""},null,{"$f":"IF(ISBLANK('8-Process Controls'!E280),\"\",'8-Process Controls'!E280)","v":""},{"$f":"IF(ISBLANK('8-Process Controls'!F280),\"\",'8-Process Controls'!F280)","v":""},{"$f":"IF(ISBLANK('8-Process Controls'!G280),\"\",IF(LEFT('8-Process Controls'!G280,1)=\"Y\",\"PT\",\"\"))","v":""},null,{"$f":"IF(ISBLANK('8-Process Controls'!S280),\"\",'8-Process Controls'!S280)","v":""},{"$f":"IF(ISBLANK('8-Process Controls'!T280),\"\",'8-Process Controls'!T280)","v":""},null,null,null,null,null,null,null,null,null,null,null,null,null,{"$f":"IF(ISBLANK('8-Process Controls'!U280),\"\",'8-Process Controls'!U280)","v":""}]
[{"$f":"IF(ISBLANK('8-Process Controls'!C281),\"\",'8-Process Controls'!C281)","v":""},{"$f":"IF(ISBLANK('8-Process Controls'!D281),\"\",'8-Process Controls'!D281)","v":""},null,{"$f":"IF(ISBLANK('8-Process Controls'!E281),\"\",'8-Process Controls'!E281)","v":""},{"$f":"IF(ISBLANK('8-Process Controls'!F281),\"\",'8-Process Controls'!F281)","v":""},{"$f":"IF(ISBLANK('8-Process Controls'!G281),\"\",IF(LEFT('8-Process Controls'!G281,1)=\"Y\",\"PT\",\"\"))","v":""},null,{"$f":"IF(ISBLANK('8-Process Controls'!S281),\"\",'8-Process Controls'!S281)","v":""},{"$f":"IF(ISBLANK('8-Process Controls'!T281),\"\",'8-Process Controls'!T281)","v":""},null,null,null,null,null,null,null,null,null,null,null,null,null,{"$f":"IF(ISBLANK('8-Process Controls'!U281),\"\",'8-Process Controls'!U281)","v":""}]
[{"$f":"IF(ISBLANK('8-Process Controls'!C282),\"\",'8-Process Controls'!C282)","v":""},{"$f":"IF(ISBLANK('8-Process Controls'!D282),\"\",'8-Process Controls'!D282)","v":""},null,{"$f":"IF(ISBLANK('8-Process Controls'!E282),\"\",'8-Process Controls'!E282)","v":""},{"$f":"IF(ISBLANK('8-Process Controls'!F282),\"\",'8-Process Controls'!F282)","v":""},{"$f":"IF(ISBLANK('8-Process Controls'!G282),\"\",IF(LEFT('8-Process Controls'!G282,1)=\"Y\",\"PT\",\"\"))","v":""},null,{"$f":"IF(ISBLANK('8-Process Controls'!S282),\"\",'8-Process Controls'!S282)","v":""},{"$f":"IF(ISBLANK('8-Process Controls'!T282),\"\",'8-Process Controls'!T282)","v":""},null,null,null,null,null,null,null,null,null,null,null,null,null,{"$f":"IF(ISBLANK('8-Process Controls'!U282),\"\",'8-Process Controls'!U282)","v":""}]
[{"$f":"IF(ISBLANK('8-Process Controls'!C283),\"\",'8-Process Controls'!C283)","v":""},{"$f":"IF(ISBLANK('8-Process Controls'!D283),\"\",'8-Process Controls'!D283)","v":""},null,{"$f":"IF(ISBLANK('8-Process Controls'!E283),\"\",'8-Process Controls'!E283)","v":""},{"$f":"IF(ISBLANK('8-Process Controls'!F283),\"\",'8-Process Controls'!F283)","v":""},{"$f":"IF(ISBLANK('8-Process Controls'!G283),\"\",IF(LEFT('8-Process Controls'!G283,1)=\"Y\",\"PT\",\"\"))","v":""},null,{"$f":"IF(ISBLANK('8-Process Controls'!S283),\"\",'8-Process Controls'!S283)","v":""},{"$f":"IF(ISBLANK('8-Process Controls'!T283),\"\",'8-Process Controls'!T283)","v":""},null,null,null,null,null,null,null,null,null,null,null,null,null,{"$f":"IF(ISBLANK('8-Process Controls'!U283),\"\",'8-Process Controls'!U283)","v":""}]
[{"$f":"IF(ISBLANK('8-Process Controls'!C284),\"\",'8-Process Controls'!C284)","v":""},{"$f":"IF(ISBLANK('8-Process Controls'!D284),\"\",'8-Process Controls'!D284)","v":""},null,{"$f":"IF(ISBLANK('8-Process Controls'!E284),\"\",'8-Process Controls'!E284)","v":""},{"$f":"IF(ISBLANK('8-Process Controls'!F284),\"\",'8-Process Controls'!F284)","v":""},{"$f":"IF(ISBLANK('8-Process Controls'!G284),\"\",IF(LEFT('8-Process Controls'!G284,1)=\"Y\",\"PT\",\"\"))","v":""},null,{"$f":"IF(ISBLANK('8-Process Controls'!S284),\"\",'8-Process Controls'!S284)","v":""},{"$f":"IF(ISBLANK('8-Process Controls'!T284),\"\",'8-Process Controls'!T284)","v":""},null,null,null,null,null,null,null,null,null,null,null,null,null,{"$f":"IF(ISBLANK('8-Process Controls'!U284),\"\",'8-Process Controls'!U284)","v":""}]
[{"$f":"IF(ISBLANK('8-Process Controls'!C285),\"\",'8-Process Controls'!C285)","v":""},{"$f":"IF(ISBLANK('8-Process Controls'!D285),\"\",'8-Process Controls'!D285)","v":""},null,{"$f":"IF(ISBLANK('8-Process Controls'!E285),\"\",'8-Process Controls'!E285)","v":""},{"$f":"IF(ISBLANK('8-Process Controls'!F285),\"\",'8-Process Controls'!F285)","v":""},{"$f":"IF(ISBLANK('8-Process Controls'!G285),\"\",IF(LEFT('8-Process Controls'!G285,1)=\"Y\",\"PT\",\"\"))","v":""},null,{"$f":"IF(ISBLANK('8-Process Controls'!S285),\"\",'8-Process Controls'!S285)","v":""},{"$f":"IF(ISBLANK('8-Process Controls'!T285),\"\",'8-Process Controls'!T285)","v":""},null,null,null,null,null,null,null,null,null,null,null,null,null,{"$f":"IF(ISBLANK('8-Process Controls'!U285),\"\",'8-Process Controls'!U285)","v":""}]
[{"$f":"IF(ISBLANK('8-Process Controls'!C286),\"\",'8-Process Controls'!C286)","v":""},{"$f":"IF(ISBLANK('8-Process Controls'!D286),\"\",'8-Process Controls'!D286)","v":""},null,{"$f":"IF(ISBLANK('8-Process Controls'!E286),\"\",'8-Process Controls'!E286)","v":""},{"$f":"IF(ISBLANK('8-Process Controls'!F286),\"\",'8-Process Controls'!F286)","v":""},{"$f":"IF(ISBLANK('8-Process Controls'!G286),\"\",IF(LEFT('8-Process Controls'!G286,1)=\"Y\",\"PT\",\"\"))","v":""},null,{"$f":"IF(ISBLANK('8-Process Controls'!S286),\"\",'8-Process Controls'!S286)","v":""},{"$f":"IF(ISBLANK('8-Process Controls'!T286),\"\",'8-Process Controls'!T286)","v":""},null,null,null,null,null,null,null,null,null,null,null,null,null,{"$f":"IF(ISBLANK('8-Process Controls'!U286),\"\",'8-Process Controls'!U286)","v":""}]
[{"$f":"IF(ISBLANK('8-Process Controls'!C287),\"\",'8-Process Controls'!C287)","v":""},{"$f":"IF(ISBLANK('8-Process Controls'!D287),\"\",'8-Process Controls'!D287)","v":""},null,{"$f":"IF(ISBLANK('8-Process Controls'!E287),\"\",'8-Process Controls'!E287)","v":""},{"$f":"IF(ISBLANK('8-Process Controls'!F287),\"\",'8-Process Controls'!F287)","v":""},{"$f":"IF(ISBLANK('8-Process Controls'!G287),\"\",IF(LEFT('8-Process Controls'!G287,1)=\"Y\",\"PT\",\"\"))","v":""},null,{"$f":"IF(ISBLANK('8-Process Controls'!S287),\"\",'8-Process Controls'!S287)","v":""},{"$f":"IF(ISBLANK('8-Process Controls'!T287),\"\",'8-Process Controls'!T287)","v":""},null,null,null,null,null,null,null,null,null,null,null,null,null,{"$f":"IF(ISBLANK('8-Process Controls'!U287),\"\",'8-Process Controls'!U287)","v":""}]
[{"$f":"IF(ISBLANK('8-Process Controls'!C288),\"\",'8-Process Controls'!C288)","v":""},{"$f":"IF(ISBLANK('8-Process Controls'!D288),\"\",'8-Process Controls'!D288)","v":""},null,{"$f":"IF(ISBLANK('8-Process Controls'!E288),\"\",'8-Process Controls'!E288)","v":""},{"$f":"IF(ISBLANK('8-Process Controls'!F288),\"\",'8-Process Controls'!F288)","v":""},{"$f":"IF(ISBLANK('8-Process Controls'!G288),\"\",IF(LEFT('8-Process Controls'!G288,1)=\"Y\",\"PT\",\"\"))","v":""},null,{"$f":"IF(ISBLANK('8-Process Controls'!S288),\"\",'8-Process Controls'!S288)","v":""},{"$f":"IF(ISBLANK('8-Process Controls'!T288),\"\",'8-Process Controls'!T288)","v":""},null,null,null,null,null,null,null,null,null,null,null,null,null,{"$f":"IF(ISBLANK('8-Process Controls'!U288),\"\",'8-Process Controls'!U288)","v":""}]
[{"$f":"IF(ISBLANK('8-Process Controls'!C289),\"\",'8-Process Controls'!C289)","v":""},{"$f":"IF(ISBLANK('8-Process Controls'!D289),\"\",'8-Process Controls'!D289)","v":""},null,{"$f":"IF(ISBLANK('8-Process Controls'!E289),\"\",'8-Process Controls'!E289)","v":""},{"$f":"IF(ISBLANK('8-Process Controls'!F289),\"\",'8-Process Controls'!F289)","v":""},{"$f":"IF(ISBLANK('8-Process Controls'!G289),\"\",IF(LEFT('8-Process Controls'!G289,1)=\"Y\",\"PT\",\"\"))","v":""},null,{"$f":"IF(ISBLANK('8-Process Controls'!S289),\"\",'8-Process Controls'!S289)","v":""},{"$f":"IF(ISBLANK('8-Process Controls'!T289),\"\",'8-Process Controls'!T289)","v":""},null,null,null,null,null,null,null,null,null,null,null,null,null,{"$f":"IF(ISBLANK('8-Process Controls'!U289),\"\",'8-Process Controls'!U289)","v":""}]
[{"$f":"IF(ISBLANK('8-Process Controls'!C290),\"\",'8-Process Controls'!C290)","v":""},{"$f":"IF(ISBLANK('8-Process Controls'!D290),\"\",'8-Process Controls'!D290)","v":""},null,{"$f":"IF(ISBLANK('8-Process Controls'!E290),\"\",'8-Process Controls'!E290)","v":""},{"$f":"IF(ISBLANK('8-Process Controls'!F290),\"\",'8-Process Controls'!F290)","v":""},{"$f":"IF(ISBLANK('8-Process Controls'!G290),\"\",IF(LEFT('8-Process Controls'!G290,1)=\"Y\",\"PT\",\"\"))","v":""},null,{"$f":"IF(ISBLANK('8-Process Controls'!S290),\"\",'8-Process Controls'!S290)","v":""},{"$f":"IF(ISBLANK('8-Process Controls'!T290),\"\",'8-Process Controls'!T290)","v":""},null,null,null,null,null,null,null,null,null,null,null,null,null,{"$f":"IF(ISBLANK('8-Process Controls'!U290),\"\",'8-Process Controls'!U290)","v":""}]
[{"$f":"IF(ISBLANK('8-Process Controls'!C291),\"\",'8-Process Controls'!C291)","v":""},{"$f":"IF(ISBLANK('8-Process Controls'!D291),\"\",'8-Process Controls'!D291)","v":""},null,{"$f":"IF(ISBLANK('8-Process Controls'!E291),\"\",'8-Process Controls'!E291)","v":""},{"$f":"IF(ISBLANK('8-Process Controls'!F291),\"\",'8-Process Controls'!F291)","v":""},{"$f":"IF(ISBLANK('8-Process Controls'!G291),\"\",IF(LEFT('8-Process Controls'!G291,1)=\"Y\",\"PT\",\"\"))","v":""},null,{"$f":"IF(ISBLANK('8-Process Controls'!S291),\"\",'8-Process Controls'!S291)","v":""},{"$f":"IF(ISBLANK('8-Process Controls'!T291),\"\",'8-Process Controls'!T291)","v":""},null,null,null,null,null,null,null,null,null,null,null,null,null,{"$f":"IF(ISBLANK('8-Process Controls'!U291),\"\",'8-Process Controls'!U291)","v":""}]
[{"$f":"IF(ISBLANK('8-Process Controls'!C292),\"\",'8-Process Controls'!C292)","v":""},{"$f":"IF(ISBLANK('8-Process Controls'!D292),\"\",'8-Process Controls'!D292)","v":""},null,{"$f":"IF(ISBLANK('8-Process Controls'!E292),\"\",'8-Process Controls'!E292)","v":""},{"$f":"IF(ISBLANK('8-Process Controls'!F292),\"\",'8-Process Controls'!F292)","v":""},{"$f":"IF(ISBLANK('8-Process Controls'!G292),\"\",IF(LEFT('8-Process Controls'!G292,1)=\"Y\",\"PT\",\"\"))","v":""},null,{"$f":"IF(ISBLANK('8-Process Controls'!S292),\"\",'8-Process Controls'!S292)","v":""},{"$f":"IF(ISBLANK('8-Process Controls'!T292),\"\",'8-Process Controls'!T292)","v":""},null,null,null,null,null,null,null,null,null,null,null,null,null,{"$f":"IF(ISBLANK('8-Process Controls'!U292),\"\",'8-Process Controls'!U292)","v":""}]
[{"$f":"IF(ISBLANK('8-Process Controls'!C293),\"\",'8-Process Controls'!C293)","v":""},{"$f":"IF(ISBLANK('8-Process Controls'!D293),\"\",'8-Process Controls'!D293)","v":""},null,{"$f":"IF(ISBLANK('8-Process Controls'!E293),\"\",'8-Process Controls'!E293)","v":""},{"$f":"IF(ISBLANK('8-Process Controls'!F293),\"\",'8-Process Controls'!F293)","v":""},{"$f":"IF(ISBLANK('8-Process Controls'!G293),\"\",IF(LEFT('8-Process Controls'!G293,1)=\"Y\",\"PT\",\"\"))","v":""},null,{"$f":"IF(ISBLANK('8-Process Controls'!S293),\"\",'8-Process Controls'!S293)","v":""},{"$f":"IF(ISBLANK('8-Process Controls'!T293),\"\",'8-Process Controls'!T293)","v":""},null,null,null,null,null,null,null,null,null,null,null,null,null,{"$f":"IF(ISBLANK('8-Process Controls'!U293),\"\",'8-Process Controls'!U293)","v":""}]
[{"$f":"IF(ISBLANK('8-Process Controls'!C294),\"\",'8-Process Controls'!C294)","v":""},{"$f":"IF(ISBLANK('8-Process Controls'!D294),\"\",'8-Process Controls'!D294)","v":""},null,{"$f":"IF(ISBLANK('8-Process Controls'!E294),\"\",'8-Process Controls'!E294)","v":""},{"$f":"IF(ISBLANK('8-Process Controls'!F294),\"\",'8-Process Controls'!F294)","v":""},{"$f":"IF(ISBLANK('8-Process Controls'!G294),\"\",IF(LEFT('8-Process Controls'!G294,1)=\"Y\",\"PT\",\"\"))","v":""},null,{"$f":"IF(ISBLANK('8-Process Controls'!S294),\"\",'8-Process Controls'!S294)","v":""},{"$f":"IF(ISBLANK('8-Process Controls'!T294),\"\",'8-Process Controls'!T294)","v":""},null,null,null,null,null,null,null,null,null,null,null,null,null,{"$f":"IF(ISBLANK('8-Process Controls'!U294),\"\",'8-Process Controls'!U294)","v":""}]
[{"$f":"IF(ISBLANK('8-Process Controls'!C295),\"\",'8-Process Controls'!C295)","v":""},{"$f":"IF(ISBLANK('8-Process Controls'!D295),\"\",'8-Process Controls'!D295)","v":""},null,{"$f":"IF(ISBLANK('8-Process Controls'!E295),\"\",'8-Process Controls'!E295)","v":""},{"$f":"IF(ISBLANK('8-Process Controls'!F295),\"\",'8-Process Controls'!F295)","v":""},{"$f":"IF(ISBLANK('8-Process Controls'!G295),\"\",IF(LEFT('8-Process Controls'!G295,1)=\"Y\",\"PT\",\"\"))","v":""},null,{"$f":"IF(ISBLANK('8-Process Controls'!S295),\"\",'8-Process Controls'!S295)","v":""},{"$f":"IF(ISBLANK('8-Process Controls'!T295),\"\",'8-Process Controls'!T295)","v":""},null,null,null,null,null,null,null,null,null,null,null,null,null,{"$f":"IF(ISBLANK('8-Process Controls'!U295),\"\",'8-Process Controls'!U295)","v":""}]
[{"$f":"IF(ISBLANK('8-Process Controls'!C296),\"\",'8-Process Controls'!C296)","v":""},{"$f":"IF(ISBLANK('8-Process Controls'!D296),\"\",'8-Process Controls'!D296)","v":""},null,{"$f":"IF(ISBLANK('8-Process Controls'!E296),\"\",'8-Process Controls'!E296)","v":""},{"$f":"IF(ISBLANK('8-Process Controls'!F296),\"\",'8-Process Controls'!F296)","v":""},{"$f":"IF(ISBLANK('8-Process Controls'!G296),\"\",IF(LEFT('8-Process Controls'!G296,1)=\"Y\",\"PT\",\"\"))","v":""},null,{"$f":"IF(ISBLANK('8-Process Controls'!S296),\"\",'8-Process Controls'!S296)","v":""},{"$f":"IF(ISBLANK('8-Process Controls'!T296),\"\",'8-Process Controls'!T296)","v":""},null,null,null,null,null,null,null,null,null,null,null,null,null,{"$f":"IF(ISBLANK('8-Process Controls'!U296),\"\",'8-Process Controls'!U296)","v":""}]
[{"$f":"IF(ISBLANK('8-Process Controls'!C297),\"\",'8-Process Controls'!C297)","v":""},{"$f":"IF(ISBLANK('8-Process Controls'!D297),\"\",'8-Process Controls'!D297)","v":""},null,{"$f":"IF(ISBLANK('8-Process Controls'!E297),\"\",'8-Process Controls'!E297)","v":""},{"$f":"IF(ISBLANK('8-Process Controls'!F297),\"\",'8-Process Controls'!F297)","v":""},{"$f":"IF(ISBLANK('8-Process Controls'!G297),\"\",IF(LEFT('8-Process Controls'!G297,1)=\"Y\",\"PT\",\"\"))","v":""},null,{"$f":"IF(ISBLANK('8-Process Controls'!S297),\"\",'8-Process Controls'!S297)","v":""},{"$f":"IF(ISBLANK('8-Process Controls'!T297),\"\",'8-Process Controls'!T297)","v":""},null,null,null,null,null,null,null,null,null,null,null,null,null,{"$f":"IF(ISBLANK('8-Process Controls'!U297),\"\",'8-Process Controls'!U297)","v":""}]
[{"$f":"IF(ISBLANK('8-Process Controls'!C298),\"\",'8-Process Controls'!C298)","v":""},{"$f":"IF(ISBLANK('8-Process Controls'!D298),\"\",'8-Process Controls'!D298)","v":""},null,{"$f":"IF(ISBLANK('8-Process Controls'!E298),\"\",'8-Process Controls'!E298)","v":""},{"$f":"IF(ISBLANK('8-Process Controls'!F298),\"\",'8-Process Controls'!F298)","v":""},{"$f":"IF(ISBLANK('8-Process Controls'!G298),\"\",IF(LEFT('8-Process Controls'!G298,1)=\"Y\",\"PT\",\"\"))","v":""},null,{"$f":"IF(ISBLANK('8-Process Controls'!S298),\"\",'8-Process Controls'!S298)","v":""},{"$f":"IF(ISBLANK('8-Process Controls'!T298),\"\",'8-Process Controls'!T298)","v":""},null,null,null,null,null,null,null,null,null,null,null,null,null,{"$f":"IF(ISBLANK('8-Process Controls'!U298),\"\",'8-Process Controls'!U298)","v":""}]
[{"$f":"IF(ISBLANK('8-Process Controls'!C299),\"\",'8-Process Controls'!C299)","v":""},{"$f":"IF(ISBLANK('8-Process Controls'!D299),\"\",'8-Process Controls'!D299)","v":""},null,{"$f":"IF(ISBLANK('8-Process Controls'!E299),\"\",'8-Process Controls'!E299)","v":""},{"$f":"IF(ISBLANK('8-Process Controls'!F299),\"\",'8-Process Controls'!F299)","v":""},{"$f":"IF(ISBLANK('8-Process Controls'!G299),\"\",IF(LEFT('8-Process Controls'!G299,1)=\"Y\",\"PT\",\"\"))","v":""},null,{"$f":"IF(ISBLANK('8-Process Controls'!S299),\"\",'8-Process Controls'!S299)","v":""},{"$f":"IF(ISBLANK('8-Process Controls'!T299),\"\",'8-Process Controls'!T299)","v":""},null,null,null,null,null,null,null,null,null,null,null,null,null,{"$f":"IF(ISBLANK('8-Process Controls'!U299),\"\",'8-Process Controls'!U299)","v":""}]
[{"$f":"IF(ISBLANK('8-Process Controls'!C300),\"\",'8-Process Controls'!C300)","v":""},{"$f":"IF(ISBLANK('8-Process Controls'!D300),\"\",'8-Process Controls'!D300)","v":""},null,{"$f":"IF(ISBLANK('8-Process Controls'!E300),\"\",'8-Process Controls'!E300)","v":""},{"$f":"IF(ISBLANK('8-Process Controls'!F300),\"\",'8-Process Controls'!F300)","v":""},{"$f":"IF(ISBLANK('8-Process Controls'!G300),\"\",IF(LEFT('8-Process Controls'!G300,1)=\"Y\",\"PT\",\"\"))","v":""},null,{"$f":"IF(ISBLANK('8-Process Controls'!S300),\"\",'8-Process Controls'!S300)","v":""},{"$f":"IF(ISBLANK('8-Process Controls'!T300),\"\",'8-Process Controls'!T300)","v":""},null,null,null,null,null,null,null,null,null,null,null,null,null,{"$f":"IF(ISBLANK('8-Process Controls'!U300),\"\",'8-Process Controls'!U300)","v":""}]
[{"$f":"IF(ISBLANK('8-Process Controls'!C301),\"\",'8-Process Controls'!C301)","v":""},{"$f":"IF(ISBLANK('8-Process Controls'!D301),\"\",'8-Process Controls'!D301)","v":""},null,{"$f":"IF(ISBLANK('8-Process Controls'!E301),\"\",'8-Process Controls'!E301)","v":""},{"$f":"IF(ISBLANK('8-Process Controls'!F301),\"\",'8-Process Controls'!F301)","v":""},{"$f":"IF(ISBLANK('8-Process Controls'!G301),\"\",IF(LEFT('8-Process Controls'!G301,1)=\"Y\",\"PT\",\"\"))","v":""},null,{"$f":"IF(ISBLANK('8-Process Controls'!S301),\"\",'8-Process Controls'!S301)","v":""},{"$f":"IF(ISBLANK('8-Process Controls'!T301),\"\",'8-Process Controls'!T301)","v":""},null,null,null,null,null,null,null,null,null,null,null,null,null,{"$f":"IF(ISBLANK('8-Process Controls'!U301),\"\",'8-Process Controls'!U301)","v":""}]
[{"$f":"IF(ISBLANK('8-Process Controls'!C302),\"\",'8-Process Controls'!C302)","v":""},{"$f":"IF(ISBLANK('8-Process Controls'!D302),\"\",'8-Process Controls'!D302)","v":""},null,{"$f":"IF(ISBLANK('8-Process Controls'!E302),\"\",'8-Process Controls'!E302)","v":""},{"$f":"IF(ISBLANK('8-Process Controls'!F302),\"\",'8-Process Controls'!F302)","v":""},{"$f":"IF(ISBLANK('8-Process Controls'!G302),\"\",IF(LEFT('8-Process Controls'!G302,1)=\"Y\",\"PT\",\"\"))","v":""},null,{"$f":"IF(ISBLANK('8-Process Controls'!S302),\"\",'8-Process Controls'!S302)","v":""},{"$f":"IF(ISBLANK('8-Process Controls'!T302),\"\",'8-Process Controls'!T302)","v":""},null,null,null,null,null,null,null,null,null,null,null,null,null,{"$f":"IF(ISBLANK('8-Process Controls'!U302),\"\",'8-Process Controls'!U302)","v":""}]
[{"$f":"IF(ISBLANK('8-Process Controls'!C303),\"\",'8-Process Controls'!C303)","v":""},{"$f":"IF(ISBLANK('8-Process Controls'!D303),\"\",'8-Process Controls'!D303)","v":""},null,{"$f":"IF(ISBLANK('8-Process Controls'!E303),\"\",'8-Process Controls'!E303)","v":""},{"$f":"IF(ISBLANK('8-Process Controls'!F303),\"\",'8-Process Controls'!F303)","v":""},{"$f":"IF(ISBLANK('8-Process Controls'!G303),\"\",IF(LEFT('8-Process Controls'!G303,1)=\"Y\",\"PT\",\"\"))","v":""},null,{"$f":"IF(ISBLANK('8-Process Controls'!S303),\"\",'8-Process Controls'!S303)","v":""},{"$f":"IF(ISBLANK('8-Process Controls'!T303),\"\",'8-Process Controls'!T303)","v":""},null,null,null,null,null,null,null,null,null,null,null,null,null,{"$f":"IF(ISBLANK('8-Process Controls'!U303),\"\",'8-Process Controls'!U303)","v":""}]
[{"$f":"IF(ISBLANK('8-Process Controls'!C304),\"\",'8-Process Controls'!C304)","v":""},{"$f":"IF(ISBLANK('8-Process Controls'!D304),\"\",'8-Process Controls'!D304)","v":""},null,{"$f":"IF(ISBLANK('8-Process Controls'!E304),\"\",'8-Process Controls'!E304)","v":""},{"$f":"IF(ISBLANK('8-Process Controls'!F304),\"\",'8-Process Controls'!F304)","v":""},{"$f":"IF(ISBLANK('8-Process Controls'!G304),\"\",IF(LEFT('8-Process Controls'!G304,1)=\"Y\",\"PT\",\"\"))","v":""},null,{"$f":"IF(ISBLANK('8-Process Controls'!S304),\"\",'8-Process Controls'!S304)","v":""},{"$f":"IF(ISBLANK('8-Process Controls'!T304),\"\",'8-Process Controls'!T304)","v":""},null,null,null,null,null,null,null,null,null,null,null,null,null,{"$f":"IF(ISBLANK('8-Process Controls'!U304),\"\",'8-Process Controls'!U304)","v":""}]
[{"$f":"IF(ISBLANK('8-Process Controls'!C305),\"\",'8-Process Controls'!C305)","v":""},{"$f":"IF(ISBLANK('8-Process Controls'!D305),\"\",'8-Process Controls'!D305)","v":""},null,{"$f":"IF(ISBLANK('8-Process Controls'!E305),\"\",'8-Process Controls'!E305)","v":""},{"$f":"IF(ISBLANK('8-Process Controls'!F305),\"\",'8-Process Controls'!F305)","v":""},{"$f":"IF(ISBLANK('8-Process Controls'!G305),\"\",IF(LEFT('8-Process Controls'!G305,1)=\"Y\",\"PT\",\"\"))","v":""},null,{"$f":"IF(ISBLANK('8-Process Controls'!S305),\"\",'8-Process Controls'!S305)","v":""},{"$f":"IF(ISBLANK('8-Process Controls'!T305),\"\",'8-Process Controls'!T305)","v":""},null,null,null,null,null,null,null,null,null,null,null,null,null,{"$f":"IF(ISBLANK('8-Process Controls'!U305),\"\",'8-Process Controls'!U305)","v":""}]
[{"$f":"IF(ISBLANK('8-Process Controls'!C306),\"\",'8-Process Controls'!C306)","v":""},{"$f":"IF(ISBLANK('8-Process Controls'!D306),\"\",'8-Process Controls'!D306)","v":""},null,{"$f":"IF(ISBLANK('8-Process Controls'!E306),\"\",'8-Process Controls'!E306)","v":""},{"$f":"IF(ISBLANK('8-Process Controls'!F306),\"\",'8-Process Controls'!F306)","v":""},{"$f":"IF(ISBLANK('8-Process Controls'!G306),\"\",IF(LEFT('8-Process Controls'!G306,1)=\"Y\",\"PT\",\"\"))","v":""},null,{"$f":"IF(ISBLANK('8-Process Controls'!S306),\"\",'8-Process Controls'!S306)","v":""},{"$f":"IF(ISBLANK('8-Process Controls'!T306),\"\",'8-Process Controls'!T306)","v":""},null,null,null,null,null,null,null,null,null,null,null,null,null,{"$f":"IF(ISBLANK('8-Process Controls'!U306),\"\",'8-Process Controls'!U306)","v":""}]
[{"$f":"IF(ISBLANK('8-Process Controls'!C307),\"\",'8-Process Controls'!C307)","v":""},{"$f":"IF(ISBLANK('8-Process Controls'!D307),\"\",'8-Process Controls'!D307)","v":""},null,{"$f":"IF(ISBLANK('8-Process Controls'!E307),\"\",'8-Process Controls'!E307)","v":""},{"$f":"IF(ISBLANK('8-Process Controls'!F307),\"\",'8-Process Controls'!F307)","v":""},{"$f":"IF(ISBLANK('8-Process Controls'!G307),\"\",IF(LEFT('8-Process Controls'!G307,1)=\"Y\",\"PT\",\"\"))","v":""},null,{"$f":"IF(ISBLANK('8-Process Controls'!S307),\"\",'8-Process Controls'!S307)","v":""},{"$f":"IF(ISBLANK('8-Process Controls'!T307),\"\",'8-Process Controls'!T307)","v":""},null,null,null,null,null,null,null,null,null,null,null,null,null,{"$f":"IF(ISBLANK('8-Process Controls'!U307),\"\",'8-Process Controls'!U307)","v":""}]
[{"$f":"IF(ISBLANK('8-Process Controls'!C308),\"\",'8-Process Controls'!C308)","v":""},{"$f":"IF(ISBLANK('8-Process Controls'!D308),\"\",'8-Process Controls'!D308)","v":""},null,{"$f":"IF(ISBLANK('8-Process Controls'!E308),\"\",'8-Process Controls'!E308)","v":""},{"$f":"IF(ISBLANK('8-Process Controls'!F308),\"\",'8-Process Controls'!F308)","v":""},{"$f":"IF(ISBLANK('8-Process Controls'!G308),\"\",IF(LEFT('8-Process Controls'!G308,1)=\"Y\",\"PT\",\"\"))","v":""},null,{"$f":"IF(ISBLANK('8-Process Controls'!S308),\"\",'8-Process Controls'!S308)","v":""},{"$f":"IF(ISBLANK('8-Process Controls'!T308),\"\",'8-Process Controls'!T308)","v":""},null,null,null,null,null,null,null,null,null,null,null,null,null,{"$f":"IF(ISBLANK('8-Process Controls'!U308),\"\",'8-Process Controls'!U308)","v":""}]
[{"$f":"IF(ISBLANK('8-Process Controls'!C309),\"\",'8-Process Controls'!C309)","v":""},{"$f":"IF(ISBLANK('8-Process Controls'!D309),\"\",'8-Process Controls'!D309)","v":""},null,{"$f":"IF(ISBLANK('8-Process Controls'!E309),\"\",'8-Process Controls'!E309)","v":""},{"$f":"IF(ISBLANK('8-Process Controls'!F309),\"\",'8-Process Controls'!F309)","v":""},{"$f":"IF(ISBLANK('8-Process Controls'!G309),\"\",IF(LEFT('8-Process Controls'!G309,1)=\"Y\",\"PT\",\"\"))","v":""},null,{"$f":"IF(ISBLANK('8-Process Controls'!S309),\"\",'8-Process Controls'!S309)","v":""},{"$f":"IF(ISBLANK('8-Process Controls'!T309),\"\",'8-Process Controls'!T309)","v":""},null,null,null,null,null,null,null,null,null,null,null,null,null,{"$f":"IF(ISBLANK('8-Process Controls'!U309),\"\",'8-Process Controls'!U309)","v":""}]
[{"$f":"IF(ISBLANK('8-Process Controls'!C310),\"\",'8-Process Controls'!C310)","v":""},{"$f":"IF(ISBLANK('8-Process Controls'!D310),\"\",'8-Process Controls'!D310)","v":""},null,{"$f":"IF(ISBLANK('8-Process Controls'!E310),\"\",'8-Process Controls'!E310)","v":""},{"$f":"IF(ISBLANK('8-Process Controls'!F310),\"\",'8-Process Controls'!F310)","v":""},{"$f":"IF(ISBLANK('8-Process Controls'!G310),\"\",IF(LEFT('8-Process Controls'!G310,1)=\"Y\",\"PT\",\"\"))","v":""},null,{"$f":"IF(ISBLANK('8-Process Controls'!S310),\"\",'8-Process Controls'!S310)","v":""},{"$f":"IF(ISBLANK('8-Process Controls'!T310),\"\",'8-Process Controls'!T310)","v":""},null,null,null,null,null,null,null,null,null,null,null,null,null,{"$f":"IF(ISBLANK('8-Process Controls'!U310),\"\",'8-Process Controls'!U310)","v":""}]
[{"$f":"IF(ISBLANK('8-Process Controls'!C311),\"\",'8-Process Controls'!C311)","v":""},{"$f":"IF(ISBLANK('8-Process Controls'!D311),\"\",'8-Process Controls'!D311)","v":""},null,{"$f":"IF(ISBLANK('8-Process Controls'!E311),\"\",'8-Process Controls'!E311)","v":""},{"$f":"IF(ISBLANK('8-Process Controls'!F311),\"\",'8-Process Controls'!F311)","v":""},{"$f":"IF(ISBLANK('8-Process Controls'!G311),\"\",IF(LEFT('8-Process Controls'!G311,1)=\"Y\",\"PT\",\"\"))","v":""},null,{"$f":"IF(ISBLANK('8-Process Controls'!S311),\"\",'8-Process Controls'!S311)","v":""},{"$f":"IF(ISBLANK('8-Process Controls'!T311),\"\",'8-Process Controls'!T311)","v":""},null,null,null,null,null,null,null,null,null,null,null,null,null,{"$f":"IF(ISBLANK('8-Process Controls'!U311),\"\",'8-Process Controls'!U311)","v":""}]
[{"$f":"IF(ISBLANK('8-Process Controls'!C312),\"\",'8-Process Controls'!C312)","v":""},{"$f":"IF(ISBLANK('8-Process Controls'!D312),\"\",'8-Process Controls'!D312)","v":""},null,{"$f":"IF(ISBLANK('8-Process Controls'!E312),\"\",'8-Process Controls'!E312)","v":""},{"$f":"IF(ISBLANK('8-Process Controls'!F312),\"\",'8-Process Controls'!F312)","v":""},{"$f":"IF(ISBLANK('8-Process Controls'!G312),\"\",IF(LEFT('8-Process Controls'!G312,1)=\"Y\",\"PT\",\"\"))","v":""},null,{"$f":"IF(ISBLANK('8-Process Controls'!S312),\"\",'8-Process Controls'!S312)","v":""},{"$f":"IF(ISBLANK('8-Process Controls'!T312),\"\",'8-Process Controls'!T312)","v":""},null,null,null,null,null,null,null,null,null,null,null,null,null,{"$f":"IF(ISBLANK('8-Process Controls'!U312),\"\",'8-Process Controls'!U312)","v":""}]
[{"$f":"IF(ISBLANK('8-Process Controls'!C313),\"\",'8-Process Controls'!C313)","v":""},{"$f":"IF(ISBLANK('8-Process Controls'!D313),\"\",'8-Process Controls'!D313)","v":""},null,{"$f":"IF(ISBLANK('8-Process Controls'!E313),\"\",'8-Process Controls'!E313)","v":""},{"$f":"IF(ISBLANK('8-Process Controls'!F313),\"\",'8-Process Controls'!F313)","v":""},{"$f":"IF(ISBLANK('8-Process Controls'!G313),\"\",IF(LEFT('8-Process Controls'!G313,1)=\"Y\",\"PT\",\"\"))","v":""},null,{"$f":"IF(ISBLANK('8-Process Controls'!S313),\"\",'8-Process Controls'!S313)","v":""},{"$f":"IF(ISBLANK('8-Process Controls'!T313),\"\",'8-Process Controls'!T313)","v":""},null,null,null,null,null,null,null,null,null,null,null,null,null,{"$f":"IF(ISBLANK('8-Process Controls'!U313),\"\",'8-Process Controls'!U313)","v":""}]
[{"$f":"IF(ISBLANK('8-Process Controls'!C314),\"\",'8-Process Controls'!C314)","v":""},{"$f":"IF(ISBLANK('8-Process Controls'!D314),\"\",'8-Process Controls'!D314)","v":""},null,{"$f":"IF(ISBLANK('8-Process Controls'!E314),\"\",'8-Process Controls'!E314)","v":""},{"$f":"IF(ISBLANK('8-Process Controls'!F314),\"\",'8-Process Controls'!F314)","v":""},{"$f":"IF(ISBLANK('8-Process Controls'!G314),\"\",IF(LEFT('8-Process Controls'!G314,1)=\"Y\",\"PT\",\"\"))","v":""},null,{"$f":"IF(ISBLANK('8-Process Controls'!S314),\"\",'8-Process Controls'!S314)","v":""},{"$f":"IF(ISBLANK('8-Process Controls'!T314),\"\",'8-Process Controls'!T314)","v":""},null,null,null,null,null,null,null,null,null,null,null,null,null,{"$f":"IF(ISBLANK('8-Process Controls'!U314),\"\",'8-Process Controls'!U314)","v":""}]
[{"$f":"IF(ISBLANK('8-Process Controls'!C315),\"\",'8-Process Controls'!C315)","v":""},{"$f":"IF(ISBLANK('8-Process Controls'!D315),\"\",'8-Process Controls'!D315)","v":""},null,{"$f":"IF(ISBLANK('8-Process Controls'!E315),\"\",'8-Process Controls'!E315)","v":""},{"$f":"IF(ISBLANK('8-Process Controls'!F315),\"\",'8-Process Controls'!F315)","v":""},{"$f":"IF(ISBLANK('8-Process Controls'!G315),\"\",IF(LEFT('8-Process Controls'!G315,1)=\"Y\",\"PT\",\"\"))","v":""},null,{"$f":"IF(ISBLANK('8-Process Controls'!S315),\"\",'8-Process Controls'!S315)","v":""},{"$f":"IF(ISBLANK('8-Process Controls'!T315),\"\",'8-Process Controls'!T315)","v":""},null,null,null,null,null,null,null,null,null,null,null,null,null,{"$f":"IF(ISBLANK('8-Process Controls'!U315),\"\",'8-Process Controls'!U315)","v":""}]
[{"$f":"IF(ISBLANK('8-Process Controls'!C316),\"\",'8-Process Controls'!C316)","v":""},{"$f":"IF(ISBLANK('8-Process Controls'!D316),\"\",'8-Process Controls'!D316)","v":""},null,{"$f":"IF(ISBLANK('8-Process Controls'!E316),\"\",'8-Process Controls'!E316)","v":""},{"$f":"IF(ISBLANK('8-Process Controls'!F316),\"\",'8-Process Controls'!F316)","v":""},{"$f":"IF(ISBLANK('8-Process Controls'!G316),\"\",IF(LEFT('8-Process Controls'!G316,1)=\"Y\",\"PT\",\"\"))","v":""},null,{"$f":"IF(ISBLANK('8-Process Controls'!S316),\"\",'8-Process Controls'!S316)","v":""},{"$f":"IF(ISBLANK('8-Process Controls'!T316),\"\",'8-Process Controls'!T316)","v":""},null,null,null,null,null,null,null,null,null,null,null,null,null,{"$f":"IF(ISBLANK('8-Process Controls'!U316),\"\",'8-Process Controls'!U316)","v":""}]
[{"$f":"IF(ISBLANK('8-Process Controls'!C317),\"\",'8-Process Controls'!C317)","v":""},{"$f":"IF(ISBLANK('8-Process Controls'!D317),\"\",'8-Process Controls'!D317)","v":""},null,{"$f":"IF(ISBLANK('8-Process Controls'!E317),\"\",'8-Process Controls'!E317)","v":""},{"$f":"IF(ISBLANK('8-Process Controls'!F317),\"\",'8-Process Controls'!F317)","v":""},{"$f":"IF(ISBLANK('8-Process Controls'!G317),\"\",IF(LEFT('8-Process Controls'!G317,1)=\"Y\",\"PT\",\"\"))","v":""},null,{"$f":"IF(ISBLANK('8-Process Controls'!S317),\"\",'8-Process Controls'!S317)","v":""},{"$f":"IF(ISBLANK('8-Process Controls'!T317),\"\",'8-Process Controls'!T317)","v":""},null,null,null,null,null,null,null,null,null,null,null,null,null,{"$f":"IF(ISBLANK('8-Process Controls'!U317),\"\",'8-Process Controls'!U317)","v":""}]
[{"$f":"IF(ISBLANK('8-Process Controls'!C318),\"\",'8-Process Controls'!C318)","v":""},{"$f":"IF(ISBLANK('8-Process Controls'!D318),\"\",'8-Process Controls'!D318)","v":""},null,{"$f":"IF(ISBLANK('8-Process Controls'!E318),\"\",'8-Process Controls'!E318)","v":""},{"$f":"IF(ISBLANK('8-Process Controls'!F318),\"\",'8-Process Controls'!F318)","v":""},{"$f":"IF(ISBLANK('8-Process Controls'!G318),\"\",IF(LEFT('8-Process Controls'!G318,1)=\"Y\",\"PT\",\"\"))","v":""},null,{"$f":"IF(ISBLANK('8-Process Controls'!S318),\"\",'8-Process Controls'!S318)","v":""},{"$f":"IF(ISBLANK('8-Process Controls'!T318),\"\",'8-Process Controls'!T318)","v":""},null,null,null,null,null,null,null,null,null,null,null,null,null,{"$f":"IF(ISBLANK('8-Process Controls'!U318),\"\",'8-Process Controls'!U318)","v":""}]
[{"$f":"IF(ISBLANK('8-Process Controls'!C319),\"\",'8-Process Controls'!C319)","v":""},{"$f":"IF(ISBLANK('8-Process Controls'!D319),\"\",'8-Process Controls'!D319)","v":""},null,{"$f":"IF(ISBLANK('8-Process Controls'!E319),\"\",'8-Process Controls'!E319)","v":""},{"$f":"IF(ISBLANK('8-Process Controls'!F319),\"\",'8-Process Controls'!F319)","v":""},{"$f":"IF(ISBLANK('8-Process Controls'!G319),\"\",IF(LEFT('8-Process Controls'!G319,1)=\"Y\",\"PT\",\"\"))","v":""},null,{"$f":"IF(ISBLANK('8-Process Controls'!S319),\"\",'8-Process Controls'!S319)","v":""},{"$f":"IF(ISBLANK('8-Process Controls'!T319),\"\",'8-Process Controls'!T319)","v":""},null,null,null,null,null,null,null,null,null,null,null,null,null,{"$f":"IF(ISBLANK('8-Process Controls'!U319),\"\",'8-Process Controls'!U319)","v":""}]
[{"$f":"IF(ISBLANK('8-Process Controls'!C320),\"\",'8-Process Controls'!C320)","v":""},{"$f":"IF(ISBLANK('8-Process Controls'!D320),\"\",'8-Process Controls'!D320)","v":""},null,{"$f":"IF(ISBLANK('8-Process Controls'!E320),\"\",'8-Process Controls'!E320)","v":""},{"$f":"IF(ISBLANK('8-Process Controls'!F320),\"\",'8-Process Controls'!F320)","v":""},{"$f":"IF(ISBLANK('8-Process Controls'!G320),\"\",IF(LEFT('8-Process Controls'!G320,1)=\"Y\",\"PT\",\"\"))","v":""},null,{"$f":"IF(ISBLANK('8-Process Controls'!S320),\"\",'8-Process Controls'!S320)","v":""},{"$f":"IF(ISBLANK('8-Process Controls'!T320),\"\",'8-Process Controls'!T320)","v":""},null,null,null,null,null,null,null,null,null,null,null,null,null,{"$f":"IF(ISBLANK('8-Process Controls'!U320),\"\",'8-Process Controls'!U320)","v":""}]
[{"$f":"IF(ISBLANK('8-Process Controls'!C321),\"\",'8-Process Controls'!C321)","v":""},{"$f":"IF(ISBLANK('8-Process Controls'!D321),\"\",'8-Process Controls'!D321)","v":""},null,{"$f":"IF(ISBLANK('8-Process Controls'!E321),\"\",'8-Process Controls'!E321)","v":""},{"$f":"IF(ISBLANK('8-Process Controls'!F321),\"\",'8-Process Controls'!F321)","v":""},{"$f":"IF(ISBLANK('8-Process Controls'!G321),\"\",IF(LEFT('8-Process Controls'!G321,1)=\"Y\",\"PT\",\"\"))","v":""},null,{"$f":"IF(ISBLANK('8-Process Controls'!S321),\"\",'8-Process Controls'!S321)","v":""},{"$f":"IF(ISBLANK('8-Process Controls'!T321),\"\",'8-Process Controls'!T321)","v":""},null,null,null,null,null,null,null,null,null,null,null,null,null,{"$f":"IF(ISBLANK('8-Process Controls'!U321),\"\",'8-Process Controls'!U321)","v":""}]
[{"$f":"IF(ISBLANK('8-Process Controls'!C322),\"\",'8-Process Controls'!C322)","v":""},{"$f":"IF(ISBLANK('8-Process Controls'!D322),\"\",'8-Process Controls'!D322)","v":""},null,{"$f":"IF(ISBLANK('8-Process Controls'!E322),\"\",'8-Process Controls'!E322)","v":""},{"$f":"IF(ISBLANK('8-Process Controls'!F322),\"\",'8-Process Controls'!F322)","v":""},{"$f":"IF(ISBLANK('8-Process Controls'!G322),\"\",IF(LEFT('8-Process Controls'!G322,1)=\"Y\",\"PT\",\"\"))","v":""},null,{"$f":"IF(ISBLANK('8-Process Controls'!S322),\"\",'8-Process Controls'!S322)","v":""},{"$f":"IF(ISBLANK('8-Process Controls'!T322),\"\",'8-Process Controls'!T322)","v":""},null,null,null,null,null,null,null,null,null,null,null,null,null,{"$f":"IF(ISBLANK('8-Process Controls'!U322),\"\",'8-Process Controls'!U322)","v":""}]
[{"$f":"IF(ISBLANK('8-Process Controls'!C323),\"\",'8-Process Controls'!C323)","v":""},{"$f":"IF(ISBLANK('8-Process Controls'!D323),\"\",'8-Process Controls'!D323)","v":""},null,{"$f":"IF(ISBLANK('8-Process Controls'!E323),\"\",'8-Process Controls'!E323)","v":""},{"$f":"IF(ISBLANK('8-Process Controls'!F323),\"\",'8-Process Controls'!F323)","v":""},{"$f":"IF(ISBLANK('8-Process Controls'!G323),\"\",IF(LEFT('8-Process Controls'!G323,1)=\"Y\",\"PT\",\"\"))","v":""},null,{"$f":"IF(ISBLANK('8-Process Controls'!S323),\"\",'8-Process Controls'!S323)","v":""},{"$f":"IF(ISBLANK('8-Process Controls'!T323),\"\",'8-Process Controls'!T323)","v":""},null,null,null,null,null,null,null,null,null,null,null,null,null,{"$f":"IF(ISBLANK('8-Process Controls'!U323),\"\",'8-Process Controls'!U323)","v":""}]
[{"$f":"IF(ISBLANK('8-Process Controls'!C324),\"\",'8-Process Controls'!C324)","v":""},{"$f":"IF(ISBLANK('8-Process Controls'!D324),\"\",'8-Process Controls'!D324)","v":""},null,{"$f":"IF(ISBLANK('8-Process Controls'!E324),\"\",'8-Process Controls'!E324)","v":""},{"$f":"IF(ISBLANK('8-Process Controls'!F324),\"\",'8-Process Controls'!F324)","v":""},{"$f":"IF(ISBLANK('8-Process Controls'!G324),\"\",IF(LEFT('8-Process Controls'!G324,1)=\"Y\",\"PT\",\"\"))","v":""},null,{"$f":"IF(ISBLANK('8-Process Controls'!S324),\"\",'8-Process Controls'!S324)","v":""},{"$f":"IF(ISBLANK('8-Process Controls'!T324),\"\",'8-Process Controls'!T324)","v":""},null,null,null,null,null,null,null,null,null,null,null,null,null,{"$f":"IF(ISBLANK('8-Process Controls'!U324),\"\",'8-Process Controls'!U324)","v":""}]
[{"$f":"IF(ISBLANK('8-Process Controls'!C325),\"\",'8-Process Controls'!C325)","v":""},{"$f":"IF(ISBLANK('8-Process Controls'!D325),\"\",'8-Process Controls'!D325)","v":""},null,{"$f":"IF(ISBLANK('8-Process Controls'!E325),\"\",'8-Process Controls'!E325)","v":""},{"$f":"IF(ISBLANK('8-Process Controls'!F325),\"\",'8-Process Controls'!F325)","v":""},{"$f":"IF(ISBLANK('8-Process Controls'!G325),\"\",IF(LEFT('8-Process Controls'!G325,1)=\"Y\",\"PT\",\"\"))","v":""},null,{"$f":"IF(ISBLANK('8-Process Controls'!S325),\"\",'8-Process Controls'!S325)","v":""},{"$f":"IF(ISBLANK('8-Process Controls'!T325),\"\",'8-Process Controls'!T325)","v":""},null,null,null,null,null,null,null,null,null,null,null,null,null,{"$f":"IF(ISBLANK('8-Process Controls'!U325),\"\",'8-Process Controls'!U325)","v":""}]
[{"$f":"IF(ISBLANK('8-Process Controls'!C326),\"\",'8-Process Controls'!C326)","v":""},{"$f":"IF(ISBLANK('8-Process Controls'!D326),\"\",'8-Process Controls'!D326)","v":""},null,{"$f":"IF(ISBLANK('8-Process Controls'!E326),\"\",'8-Process Controls'!E326)","v":""},{"$f":"IF(ISBLANK('8-Process Controls'!F326),\"\",'8-Process Controls'!F326)","v":""},{"$f":"IF(ISBLANK('8-Process Controls'!G326),\"\",IF(LEFT('8-Process Controls'!G326,1)=\"Y\",\"PT\",\"\"))","v":""},null,{"$f":"IF(ISBLANK('8-Process Controls'!S326),\"\",'8-Process Controls'!S326)","v":""},{"$f":"IF(ISBLANK('8-Process Controls'!T326),\"\",'8-Process Controls'!T326)","v":""},null,null,null,null,null,null,null,null,null,null,null,null,null,{"$f":"IF(ISBLANK('8-Process Controls'!U326),\"\",'8-Process Controls'!U326)","v":""}]
[{"$f":"IF(ISBLANK('8-Process Controls'!C327),\"\",'8-Process Controls'!C327)","v":""},{"$f":"IF(ISBLANK('8-Process Controls'!D327),\"\",'8-Process Controls'!D327)","v":""},null,{"$f":"IF(ISBLANK('8-Process Controls'!E327),\"\",'8-Process Controls'!E327)","v":""},{"$f":"IF(ISBLANK('8-Process Controls'!F327),\"\",'8-Process Controls'!F327)","v":""},{"$f":"IF(ISBLANK('8-Process Controls'!G327),\"\",IF(LEFT('8-Process Controls'!G327,1)=\"Y\",\"PT\",\"\"))","v":""},null,{"$f":"IF(ISBLANK('8-Process Controls'!S327),\"\",'8-Process Controls'!S327)","v":""},{"$f":"IF(ISBLANK('8-Process Controls'!T327),\"\",'8-Process Controls'!T327)","v":""},null,null,null,null,null,null,null,null,null,null,null,null,null,{"$f":"IF(ISBLANK('8-Process Controls'!U327),\"\",'8-Process Controls'!U327)","v":""}]
[{"$f":"IF(ISBLANK('8-Process Controls'!C328),\"\",'8-Process Controls'!C328)","v":""},{"$f":"IF(ISBLANK('8-Process Controls'!D328),\"\",'8-Process Controls'!D328)","v":""},null,{"$f":"IF(ISBLANK('8-Process Controls'!E328),\"\",'8-Process Controls'!E328)","v":""},{"$f":"IF(ISBLANK('8-Process Controls'!F328),\"\",'8-Process Controls'!F328)","v":""},{"$f":"IF(ISBLANK('8-Process Controls'!G328),\"\",IF(LEFT('8-Process Controls'!G328,1)=\"Y\",\"PT\",\"\"))","v":""},null,{"$f":"IF(ISBLANK('8-Process Controls'!S328),\"\",'8-Process Controls'!S328)","v":""},{"$f":"IF(ISBLANK('8-Process Controls'!T328),\"\",'8-Process Controls'!T328)","v":""},null,null,null,null,null,null,null,null,null,null,null,null,null,{"$f":"IF(ISBLANK('8-Process Controls'!U328),\"\",'8-Process Controls'!U328)","v":""}]
[{"$f":"IF(ISBLANK('8-Process Controls'!C329),\"\",'8-Process Controls'!C329)","v":""},{"$f":"IF(ISBLANK('8-Process Controls'!D329),\"\",'8-Process Controls'!D329)","v":""},null,{"$f":"IF(ISBLANK('8-Process Controls'!E329),\"\",'8-Process Controls'!E329)","v":""},{"$f":"IF(ISBLANK('8-Process Controls'!F329),\"\",'8-Process Controls'!F329)","v":""},{"$f":"IF(ISBLANK('8-Process Controls'!G329),\"\",IF(LEFT('8-Process Controls'!G329,1)=\"Y\",\"PT\",\"\"))","v":""},null,{"$f":"IF(ISBLANK('8-Process Controls'!S329),\"\",'8-Process Controls'!S329)","v":""},{"$f":"IF(ISBLANK('8-Process Controls'!T329),\"\",'8-Process Controls'!T329)","v":""},null,null,null,null,null,null,null,null,null,null,null,null,null,{"$f":"IF(ISBLANK('8-Process Controls'!U329),\"\",'8-Process Controls'!U329)","v":""}]
[{"$f":"IF(ISBLANK('8-Process Controls'!C330),\"\",'8-Process Controls'!C330)","v":""},{"$f":"IF(ISBLANK('8-Process Controls'!D330),\"\",'8-Process Controls'!D330)","v":""},null,{"$f":"IF(ISBLANK('8-Process Controls'!E330),\"\",'8-Process Controls'!E330)","v":""},{"$f":"IF(ISBLANK('8-Process Controls'!F330),\"\",'8-Process Controls'!F330)","v":""},{"$f":"IF(ISBLANK('8-Process Controls'!G330),\"\",IF(LEFT('8-Process Controls'!G330,1)=\"Y\",\"PT\",\"\"))","v":""},null,{"$f":"IF(ISBLANK('8-Process Controls'!S330),\"\",'8-Process Controls'!S330)","v":""},{"$f":"IF(ISBLANK('8-Process Controls'!T330),\"\",'8-Process Controls'!T330)","v":""},null,null,null,null,null,null,null,null,null,null,null,null,null,{"$f":"IF(ISBLANK('8-Process Controls'!U330),\"\",'8-Process Controls'!U330)","v":""}]
[{"$f":"IF(ISBLANK('8-Process Controls'!C331),\"\",'8-Process Controls'!C331)","v":""},{"$f":"IF(ISBLANK('8-Process Controls'!D331),\"\",'8-Process Controls'!D331)","v":""},null,{"$f":"IF(ISBLANK('8-Process Controls'!E331),\"\",'8-Process Controls'!E331)","v":""},{"$f":"IF(ISBLANK('8-Process Controls'!F331),\"\",'8-Process Controls'!F331)","v":""},{"$f":"IF(ISBLANK('8-Process Controls'!G331),\"\",IF(LEFT('8-Process Controls'!G331,1)=\"Y\",\"PT\",\"\"))","v":""},null,{"$f":"IF(ISBLANK('8-Process Controls'!S331),\"\",'8-Process Controls'!S331)","v":""},{"$f":"IF(ISBLANK('8-Process Controls'!T331),\"\",'8-Process Controls'!T331)","v":""},null,null,null,null,null,null,null,null,null,null,null,null,null,{"$f":"IF(ISBLANK('8-Process Controls'!U331),\"\",'8-Process Controls'!U331)","v":""}]
[{"$f":"IF(ISBLANK('8-Process Controls'!C332),\"\",'8-Process Controls'!C332)","v":""},{"$f":"IF(ISBLANK('8-Process Controls'!D332),\"\",'8-Process Controls'!D332)","v":""},null,{"$f":"IF(ISBLANK('8-Process Controls'!E332),\"\",'8-Process Controls'!E332)","v":""},{"$f":"IF(ISBLANK('8-Process Controls'!F332),\"\",'8-Process Controls'!F332)","v":""},{"$f":"IF(ISBLANK('8-Process Controls'!G332),\"\",IF(LEFT('8-Process Controls'!G332,1)=\"Y\",\"PT\",\"\"))","v":""},null,{"$f":"IF(ISBLANK('8-Process Controls'!S332),\"\",'8-Process Controls'!S332)","v":""},{"$f":"IF(ISBLANK('8-Process Controls'!T332),\"\",'8-Process Controls'!T332)","v":""},null,null,null,null,null,null,null,null,null,null,null,null,null,{"$f":"IF(ISBLANK('8-Process Controls'!U332),\"\",'8-Process Controls'!U332)","v":""}]
[{"$f":"IF(ISBLANK('8-Process Controls'!C333),\"\",'8-Process Controls'!C333)","v":""},{"$f":"IF(ISBLANK('8-Process Controls'!D333),\"\",'8-Process Controls'!D333)","v":""},null,{"$f":"IF(ISBLANK('8-Process Controls'!E333),\"\",'8-Process Controls'!E333)","v":""},{"$f":"IF(ISBLANK('8-Process Controls'!F333),\"\",'8-Process Controls'!F333)","v":""},{"$f":"IF(ISBLANK('8-Process Controls'!G333),\"\",IF(LEFT('8-Process Controls'!G333,1)=\"Y\",\"PT\",\"\"))","v":""},null,{"$f":"IF(ISBLANK('8-Process Controls'!S333),\"\",'8-Process Controls'!S333)","v":""},{"$f":"IF(ISBLANK('8-Process Controls'!T333),\"\",'8-Process Controls'!T333)","v":""},null,null,null,null,null,null,null,null,null,null,null,null,null,{"$f":"IF(ISBLANK('8-Process Controls'!U333),\"\",'8-Process Controls'!U333)","v":""}]
[{"$f":"IF(ISBLANK('8-Process Controls'!C334),\"\",'8-Process Controls'!C334)","v":""},{"$f":"IF(ISBLANK('8-Process Controls'!D334),\"\",'8-Process Controls'!D334)","v":""},null,{"$f":"IF(ISBLANK('8-Process Controls'!E334),\"\",'8-Process Controls'!E334)","v":""},{"$f":"IF(ISBLANK('8-Process Controls'!F334),\"\",'8-Process Controls'!F334)","v":""},{"$f":"IF(ISBLANK('8-Process Controls'!G334),\"\",IF(LEFT('8-Process Controls'!G334,1)=\"Y\",\"PT\",\"\"))","v":""},null,{"$f":"IF(ISBLANK('8-Process Controls'!S334),\"\",'8-Process Controls'!S334)","v":""},{"$f":"IF(ISBLANK('8-Process Controls'!T334),\"\",'8-Process Controls'!T334)","v":""},null,null,null,null,null,null,null,null,null,null,null,null,null,{"$f":"IF(ISBLANK('8-Process Controls'!U334),\"\",'8-Process Controls'!U334)","v":""}]

{"sheet":"EPC List","index":12,"n_rows":10,"n_cols":9,"rows_kept":10,"cut":false,"hidden":true,"merged":[[0,0,5,8],[6,0,6,8],[7,8,8,8],[7,0,8,0],[7,1,8,2],[7,3,8,3],[7,4,8,4],[7,5,8,5],[7,6,8,6],[7,7,8,7]]}
["EPC List (Auto Populate from SCS List)"]
[]
[]
[]
[]
[]
["Note: \nCopy below Characteristic list into F1075 EPC workbook and follow up EPC activity in safe launch phase."]
["Road Map #","Product Characteristic\nDescription",null,"Dimension & Tolerance (with units)","Class","PT","Lesson Learn Input","EPC (Y/N)","SPC control & ongoing capability study in EPC phase"]
[]
[{"$f":"_xlfn._xlws.FILTER('SCS List'!A11:I339,'SCS List'!H11:H339=\"Yes\",\"\")","v":""}]

{"sheet":"9-Open Issues","index":13,"n_rows":11,"n_cols":10,"rows_kept":11,"cut":false,"hidden":false,"merged":[[0,0,3,6],[4,7,4,8],[4,0,5,0],[4,1,5,1],[4,2,5,2],[4,3,5,3],[4,4,5,4],[4,5,5,5],[4,6,5,6]]}
["Manufacturability Assessment and Process Plan - Open Issues",null,null,null,null,null,null,"Issue Identified","►"]
[null,null,null,null,null,null,null,"Action Plan Proposed","►","CP_1"]
[null,null,null,null,null,null,null,"Action Plan Implemented","►","CP_2"]
[null,null,null,null,null,null,null,"Issue Resolved","►","CP_3"]
["Issue No.","Issue Origin/Date (Auto Fill row 6 down)","Issues \nDescription and/or Sketch\n(Auto Fill row 6 down)","Issue Owner Name \n(Auto Fill row 6 down)","Assigned Date/Status Date","Action Plan \n(Auto Fill row 6 down)","Forecast Completion Date","Open Issue Status",null,"CP_4"]
[null,null,null,null,null,null,null,"Comments","Progress","CP_5"]
[1]
[2]
[3]
[4]
[5]

{"sheet":"10-Supplier Commitment","index":14,"n_rows":56,"n_cols":29,"rows_kept":56,"cut":false,"hidden":false,"merged":[[0,0,0,6],[49,1,49,2],[17,5,17,6],[15,5,15,6],[9,0,9,6],[11,5,11,6],[13,5,13,6],[47,0,47,6],[35,5,35,6],[37,5,37,6],[29,5,29,6],[33,5,33,6],[31,5,31,6],[1,0,1,6],[46,5,46,6],[28,5,28,6],[55,0,55,6],[56,0,56,6],[50,1,50,2],[51,1,51,2],[52,1,52,2],[53,1,53,2],[48,0,48,6],[3,5,3,6],[5,5,5,6],[7,5,7,6],[27,5,27,6],[21,0,21,6],[25,5,25,6],[39,0,39,6],[43,1,43,6],[45,1,45,6],[22,3,23,3],[19,5,19,6]]}
["Manufacturability Assessment and Process Plan - Supplier Commitment",null,null,null,null,null,null,null,null,null,null,null,null,null,null,null,null,null,null,null,null,null,null,null,null,null,null,null,"\n\n\n\n\nSIGNATURES NOT ALLOWED UNTIL MAPP STATUS IS \"PASS\"!\nSee 1-Program Info tab for more details"]
["CAPACITY REQUIREMENTS"]
[]
["Number of working Days / Year",{"$f":"IF(ISBLANK('7-Capacity Plan'!AF3),\"\",'7-Capacity Plan'!AF3)","v":""},null,null,null,"Supplier commits to meet Tool Capacity in 48 weeks with no more than 100 working hours per 5 day work week."]
[]
["Annual Program Tool Capacity (LCR)",{"$f":"IF('1-Program Info'!B17=\"[Enter LCR]\",\"\",'1-Program Info'!B17)","v":""},null,null,null,"Supplier commits to meet Tool Capacity with no more than 100 working hours per 5 day work week."]
[]
["Maximum Program Tool Capacity (MCR)",{"$f":"'1-Program Info'!B19","v":"[Calculated Field]"},null,null,null,{"$f":"IF(B8=\"[Calculated Field]\",\"\",\"Supplier commits to produce \"&'1-Program Info'!B18*100&\" over the Annual Tool Capacity without additional capital investment (including additional tooling) on a sustained basis in no more than 120 Hrs\")","v":""}]
[]
["INVESTMENT TIMING - Based on Long Leadtime item & KickOff Date"]
[]
["Equipment",{"$f":"IFERROR(SUM(B$26+C12),\"[Calculated Field]\")","v":"[Calculated Field]"},{"$f":"MAX('5-Investment Timing'!L3:L22)*7","v":0},null,null,"Based on Longest leadtime item in this section.  The color rating takes into account the average time to complete PPAP samples, the necessary measurements, & paperwork"]
[]
["Tooling",{"$f":"IFERROR(SUM(B$26+C14),\"[Calculated Field]\")","v":"[Calculated Field]"},{"$f":"MAX('5-Investment Timing'!L24:L43)*7","v":0},null,null,"Based on Longest leadtime item in this section.  The color rating takes into account the average time to complete PPAP samples, the necessary measurements, & paperwork"]
[]
["Special Gauges",{"$f":"IFERROR(SUM(B$26+C16),\"[Calculated Field]\")","v":"[Calculated Field]"},{"$f":"MAX('5-Investment Timing'!L45:L64)*7","v":0},null,null,"Based on Longest leadtime item in this section.  The color rating takes into account the average time to complete PPAP samples, the necessary measurements, & paperwork"]
[]
["DV/PV Equipment & Fixtures",{"$f":"IFERROR(SUM(B$26+C18),\"[Calculated Field]\")","v":"[Calculated Field]"},{"$f":"MAX('5-Investment Timing'!L66:L85)*7","v":0},null,null,"Based on Longest leadtime item in this section.  The color rating takes into account the average time to complete PPAP samples, the necessary measurements, & paperwork"]
[]
["Facility Investment",{"$f":"IFERROR(SUM(B$26+C20),\"[Calculated Field]\")","v":"[Calculated Field]"},{"$f":"MAX('5-Investment Timing'!J87:J106)*7","v":0},null,null,"Based on Longest leadtime item in this section.  The color rating takes into account the average time to complete PPAP samples, the necessary measurements, & paperwork"]
[]
["PROGRAM TIMING REQUIREMENTS"]
[null,null,null,"Confirm timing can be met:"]
[]
[]
["Kickoff Date",{"$f":"IF('1-Program Info'!B25=\"[Enter Date]\",\"\",IF('1-Program Info'!B25=\"\",\"No Date Entered\",'1-Program Info'!B25))","v":""},null,"[Yes/No]",null,"Date for the beginning of supplier's lead time, with intent to meet timing requirements included in this \ndocument (Off-tool samples, PPAP, etc.)."]
[]
["Due Date for PPAP Submission to AQE",{"$f":"IF('1-Program Info'!B27=\"[Enter Date]\",\"\",IF('1-Program Info'!B27=\"\",\"No Date Entered\",'1-Program Info'!B27))","v":""},null,"[Yes/No]",null,"Date Supplier commits to have completed PPAP documentation and data to the AQE & PPAP parts are ready for shipment"]
[]
["MQ1 Required Date",{"$f":"IF('1-Program Info'!B29=\"[Enter Date]\",\"\",IF('1-Program Info'!B29=\"\",\"No Date Entered\",'1-Program Info'!B29))","v":""},null,"[Yes/No]",null,"Supplier commits to deliver PPAP level parts"]
[]
["MQ2 Required Date",{"$f":"IF('1-Program Info'!B31=\"[Enter Date]\",\"\",IF('1-Program Info'!B31=\"\",\"No Date Entered\",'1-Program Info'!B31))","v":""},null,"[Yes/No]",null,"Supplier commits to deliver PPAP level parts",null,null,null,null,null,"\n\n\n\n\nSIGNATURES NOT ALLOWED UNTIL MAPP STATUS IS \"PASS\"!\nSee 1-Program Info tab for more details"]
[]
["Run at Rate Date(s)\n(on or before)",{"$f":"IF('1-Program Info'!B33=\"[Enter Date]\",\"\",IF('1-Program Info'!B33=\"\",\"No Date Entered\",'1-Program Info'!B33))","v":""},null,"[Yes/No]",null,"Supply commits to successfully achieve Demonstration of Capacitized production volume utilizing PPAP approved process, material, & operators on the full complement of production intent equipment."]
[]
["Nexteer Start of Production (SOP) Date",{"$f":"IF('1-Program Info'!B43=\"[Enter Date]\",\"\",IF('1-Program Info'!B43=\"\",\"No Date Entered\",'1-Program Info'!B43))","v":""},null,"[Yes/No]",null,"Supplier commits to ramp-up ahead of this date per schedule requirements, to ensure supply consistency"]
[]
["Early Production Containment Exit Date",{"$f":"IF('1-Program Info'!B45=\"[Calculated Field]\",\"\",IF('1-Program Info'!B45=\"\",\"No Date Entered\",'1-Program Info'!B45))","v":""},null,"[Yes/No]",null,"The supplier commits to maintaining EPC unless EPC failure occur requiring the Containment to be extended      "]
[]
["Manufacturing Feasibility"]
[]
["Supplier Select one of the Manufacturing feasibility responses"]
[]
[null,"Manufacturing is confident that the design is manufacturable to Nexteer's required quality levels, within design specifications, and PPAP capability requirements.  Manufacturing is making a commitment to achieve zero defects as specified in the Nexteer Supplier Requirements."]
["OR"]
[null,"Manufacturing has concerns with the design that prohibit our confidence to produce this part to Nexteer's required quality levels based on: (1) Design record specifications, or (2) Ability to meet PPAP capability requirements. Issues documented on the Open Issues List. "]
[]
["SUPPLIER COMMITMENT"]
["Signature below signifies that Supplier agrees to the dates listed above and will close any Open Status Issues with Mitigation Plans owned by the Supplier.   Note:  One authorized signature is acceptable on behalf of the entire Supplier Organization provided that Sheet \"2-Supplier Information\" Contact Information is completed.  Acceptable forms of signature: DocuSign electronic signature, Physical signature or approval email."]
["Title","Name",null,null,null,"Signature","Date"]
["Sales"]
["Program Manager"]
["Quality"]
["Manufacturing"]
[]
["NOTE: By signing this document, you are agreeing to ALL the details documented within this MAPP. Any changes to this agreement must be reviewed and reapproved by the AQE and the affected team member(s). (i.e.; changes to gaging, control methods, or sample size and frequency of inspection, etc. must be approved by the AQE and the PE)"]

{"sheet":"11-Risk Assessment (Ext)","index":15,"n_rows":56,"n_cols":10,"rows_kept":56,"cut":false,"hidden":true,"merged":[[55,2,55,6],[55,8,55,9],[3,7,3,9],[52,2,52,6],[52,8,52,9],[53,2,53,6],[53,8,53,9],[54,2,54,6],[54,8,54,9],[43,3,43,9],[33,3,33,9],[45,2,45,9],[51,2,51,6],[51,8,51,9],[17,2,17,7],[18,2,18,7],[0,1,0,9],[6,8,6,9],[3,3,3,5],[4,1,4,2],[4,3,4,5],[4,8,4,9],[5,1,5,2],[5,3,5,5],[5,8,5,9],[3,1,3,2],[1,1,1,2],[1,3,1,4],[1,6,1,8],[1,9,2,9],[2,1,2,2],[6,3,6,5],[2,3,2,4],[12,2,12,7],[13,2,13,7],[14,2,14,7],[7,1,7,2],[7,3,7,7],[8,2,8,7],[9,2,9,7],[10,2,10,7],[11,2,11,7],[6,1,6,2],[2,6,2,8],[16,2,16,7],[15,2,15,7],[22,2,22,7],[23,2,23,7],[20,2,20,7],[21,2,21,7],[19,2,19,7],[35,7,37,7],[35,8,37,8],[35,9,37,9],[24,2,24,7],[25,2,25,7],[32,2,32,7],[29,2,29,7],[30,2,30,7],[31,2,31,7],[28,2,28,7],[26,2,26,7],[27,2,27,7],[46,2,46,9],[47,2,47,5],[48,1,48,9],[41,1,41,2],[42,1,42,2],[42,4,42,5],[44,1,44,2],[44,3,44,4],[44,6,44,7],[29,10,30,12],[16,10,16,11],[35,0,37,0],[35,1,37,1],[35,2,40,2],[38,0,40,0],[38,1,40,1],[34,3,34,9],[38,9,40,9],[38,3,40,3],[38,4,40,4],[38,6,40,6],[38,7,40,7],[38,8,40,8],[35,3,37,3],[35,6,37,6]]}
[null,"EXTERNAL RISK ASSESSMENT"]
[null,"Part Number:",null,{"$f":"IF('1-Program Info'!B5=\"[Enter PN Here]\",\"\",'1-Program Info'!B5)","v":""},null,"Part Description:",{"$f":"IF('1-Program Info'!B3=\"[Enter Part Name Here]\",\"\",'1-Program Info'!B3)","v":""},null,null,{"$f":"IF($H$48=\"Assessment Incomplete!\",\"Assessment Incomplete!\",IF($H$56<>0,\"HIGH External Risk\",IF($H$55=0,\"LOW External Risk\",\"MEDIUM External Risk\")))","v":"Assessment Incomplete!"}]
[null,"Drawing Revision:",null,{"$f":"IF('1-Program Info'!B7=\"[Enter Drwg Rev Here]\",\"\",'1-Program Info'!B7)","v":""},null,"Program:"]
[null,"Team Participants",null,"Name",null,null,null,"Name"]
[null,"Buyer",null,{"$f":"IF('1-Program Info'!C49=\"[Enter Name]\",\"[Enter Buyer Name on Program Tab]\",'1-Program Info'!C49)","v":"[Enter Buyer Name on Program Tab]"},null,null,null,"Product Engineering",{"$f":"IF('1-Program Info'!C53=\"[Enter Name]\",\"[Enter PE Name on Program Tab]\",'1-Program Info'!C53)","v":"[Enter PE Name on Program Tab]"}]
[null,"Supplier Region AQE",null,{"$f":"IF('1-Program Info'!C50=\"[Enter Name]\",\"[Enter AQE Name on Program Tab]\",'1-Program Info'!C50)","v":"[Enter AQE Name on Program Tab]"},null,null,null,"Logistics"]
[null,"Program Manager",null,{"$f":"IF('1-Program Info'!C51=\"[Enter Name]\",\"[Enter Program Manager Name on Program Tab]\",'1-Program Info'!C51)","v":"[Enter Program Manager Name on Program Tab]"},null,null,null,"Optional - Quality / Mfg Eng"]
[null,"Item",null,"Risk Factor",null,null,null,null,"Assessment","Comments"]
[null,1,"Is the supplier new to Nexteer?\n    No = Level 0\n    Yes = Level 3",null,null,null,null,null,{"$f":"IF('3-Supplier Feasibility'!N3=\"\",\"\",IF('3-Supplier Feasibility'!N3=\"Yes\",\"Level 0\",\"Level 3\"))","v":""}]
[null,2,"Is the supplier's manufacturing site new to Nexteer? \n    No = Level 0\n    Yes = Level 2",null,null,null,null,null,{"$f":"IF(OR('3-Supplier Feasibility'!N3=\"\",'3-Supplier Feasibility'!N4=\"\"),\"\",IF(AND('3-Supplier Feasibility'!N3=\"Yes\",'3-Supplier Feasibility'!N4=\"No\"),\"Level 2\",IF(AND('3-Supplier Feasibility'!N4=\"Yes\",'4-Technical Review'!E14=\"Existing\"),\"Level 0\",\"Level 2\")))","v":""}]
[null,3,"Is the proposed manufacturing site new for the supplier?\n    No = Level 0\n    Yes = Level 3",null,null,null,null,null,{"$f":"IF('4-Technical Review'!E14=\"\",\"\",IF(OR('4-Technical Review'!E14=\"New\",'4-Technical Review'!E14=\"Greenfield-under Construction\"),\"Level 3\",\"Level 0\"))","v":""}]
[null,4,"Is the supplier manufacturing site in the same region as Nexteer plant?\n    Yes = Level 0\n    No = Level 2",null,null,null,null,null,{"$f":"IF(OR('1-Program Info'!F13=\"[Select Region from Drop Down]\",'2-Supplier Information'!D6=\"[Select Region from Drop Down]\"),\"\",IF('1-Program Info'!F13='2-Supplier Information'!D6,\"Level 0\",\"Level 2\"))","v":""}]
[null,5,"Is there an MCA risk?\n    Green  = Level 0\n    Yellow  = Level 1\n    Red  = Level 2\n    Not Complete = Level 3",null,null,null,null,null,{"$f":"IF('1-Program Info'!L3=\"\",\"\",IF('1-Program Info'!L3=\"No\",\"Level 3\",IF('1-Program Info'!M5=\"\",\"\",IF('1-Program Info'!M5=\"Green\",\"Level 0\",IF('1-Program Info'!M5=\"Yellow\",\"Level 1\",\"Level 2\")))))","v":""}]
[null,6,"MCA/NSA Risk?\n    >= 90% = Level 0\n    67% and 90% = Level 1\n    below 67% = Level 2\n    Not Complete = Level 3",null,null,null,null,null,{"$f":"IF('1-Program Info'!L3=\"\",\"\",IF('1-Program Info'!L3=\"No\",\"Level 3\",IF('1-Program Info'!L5=\"\",\"\",IF('1-Program Info'!L5>=90%,\"Level 0\",IF(AND('1-Program Info'!L5>67%,'1-Program Info'!L5<90%),\"Level 1\",\"Level 2\")))))","v":""}]
[null,7,"Special Process Audits Risks?\n    All completed are Green  = Level 0\n    At least one is Yellow  = Level 1\n    At least one is Red  = Level 2\n    Required but Not Complete = Level 3",null,null,null,null,null,{"$f":"IF('1-Program Info'!AH10=\"\",\"\",IF('1-Program Info'!AH10=\"NC\",\"Level 3\",IF('1-Program Info'!AH10<75,\"Level 2\",IF('1-Program Info'!AH10>=90,\"Level 0\",\"Level 1\"))))","v":"Level 2"}]
[null,8,"Is there a valid Quality certification?\n    IATF 16949 = Level 0\n    ISO9001 w/ Plan (Registrar Letterhead) to meet IATF Requirements = Level 1\n    ISO9001 w/o Plan to meet IATF Requirements = Level 2\n    No Certification = Level 3",null,null,null,null,null,{"$f":"IF('3-Supplier Feasibility'!N15=\"\",\"\",IF('3-Supplier Feasibility'!N15=\"IATF16949\",\"Level 0\",IF('3-Supplier Feasibility'!N15=\"ISO9001 w/app'd IATF plan\",\"Level 1\",IF('3-Supplier Feasibility'!N15=\"ISO9001 w/no plan\",\"Level 2\", \"Level 3\"))))","v":""}]
[null,9,"Nexteer SQ accessability to the supplier's manufacturing site?\n    In Country driving distance = Level 0\n    In Country +4hr travel time = Level 1\n    In Region, travel time +4hr but safe travel = Level 2\n    In Region, but travel risky or unsafe = Level 3",null,null,null,null,null,{"$f":"IF(OR('1-Program Info'!B13=\"[Select Country from Drop Down]\",'2-Supplier Information'!B6=\"[Select Country from Drop Down]\"),\"\",IF('1-Program Info'!B13='2-Supplier Information'!B6,\"Level 1\",IF('1-Program Info'!F13='2-Supplier Information'!D6,\"Level 2\",\"Level 3\")))","v":""}]
[null,10,"Does the supplier agree to all NSR requirements?\n    Yes = Level 0\n    No, with signed agreement = Level 2\n    No = Show Stopper",null,null,null,null,null,{"$f":"IF('3-Supplier Feasibility'!N6=\"\",\"\",IF('3-Supplier Feasibility'!N6=\"Yes\",\"Level 0\",IF('3-Supplier Feasibility'!T6=\"Mitigation Plan Approved\",\"Level 2\",\"SHOW STOPPER\")))","v":""}]
[null,11,"Does the supplier meet Nexteer's labeling specification requirements?\n    Yes, with equipment available today and meets technology requirements = Level 0\n    No, investment and new technology is required to meet requirements = Level 2\n    No, with no intention to comply = Show Stopper",null,null,null,null,null,{"$f":"IF('3-Supplier Feasibility'!N14=\"\",\"\",IF('3-Supplier Feasibility'!N14=\"Yes\",\"Level 0\",IF('3-Supplier Feasibility'!T14=\"Mitigation Plan Approved\",\"Level 2\",\"SHOW STOPPER\")))","v":""}]
[null,12,"Does the supplier use the required raw material today?\nYes, same grade/same size = Level 0\nYes, same grade/different size = Level 1\nNo, different grade/similar size = Level 2\nNo, nothing in production = Level 3",null,null,null,null,null,{"$f":"IF(OR('4-Technical Review'!E34=\"\",'4-Technical Review'!E11=\"\"),\"\",IF('4-Technical Review'!E34=\"Yes\",IF('4-Technical Review'!E11=\"Yes\",\"Level 0\",\"Level 1\"),IF('4-Technical Review'!E11=\"Yes\",\"Level 2\",\"Level 3\")))","v":""}]
[null,13,"Is new equipment required for the proposed manufacturing process?\n    Yes = Level 3\n    No, refurbishment required = Level 2\n    No=Level 0",null,null,null,null,null,{"$f":"IF(OR('4-Technical Review'!E42=\"\",'4-Technical Review'!E14=\"\"),\"\",IF('4-Technical Review'!E42=\"No\",\"Level 0\",IF('4-Technical Review'!E14=\"Renovation Required\",\"Level 2\",\"Level 3\")))","v":""}]
[null,14,"Does the supplier's current manufacturing experience meet Nexteer's part/process requirements?\n    Yes, on site today = Level 0\n    Yes, in another supplier plant = Level 1\n    No, Development required = Level 3",null,null,null,null,null,{"$f":"IF('4-Technical Review'!E26=\"\",\"\",IF('4-Technical Review'!E26=\"Yes (on site today)\",\"Level 0\",IF('4-Technical Review'!E26=\"Yes (in another plant)\",\"Level 1\",\"Level 3\")))","v":""}]
[null,15,"Does supplier Commit to Meet ALL Required Process Indices\n    Yes - Level 0\n    No and X1331 is approved or not required - Level 1\n    No, X1331 has not been approved but is consistent with other similar parts & suppliers - Level 2\n    No - Level 3",null,null,null,null,null,{"$f":"IF(COUNTBLANK('8-Process Controls'!J6:J334)=329,\"\",IF(COUNTIF('8-Process Controls'!J6:J334,\"No\")>0,\"Level 3\",\"Level 0\"))","v":""}]
[null,16,"Does the supplier's traceability in place today meet Nexteer's requirement?\n    Yes = Level 0\n    No, but plans to develop = Level 2\n    No, no plan to develop = Level 3",null,null,null,null,null,{"$f":"IF(COUNTBLANK('8-Process Controls'!P6:P334)=329,\"\",IF(COUNTIF('8-Process Controls'!P6:P334,\"None\")>0,\"Level 3\",\"Level 0\"))","v":""}]
[null,17,"Can supplier meet the Program capacity requirement?\n    Yes = Level 0\n    Supplier requires ramp plan = Level 2\n    Supplier capacity plan violates one or more of the 240 working days/year, 100 hrs/week, 5 days/week Nexteer Guideline - Level 3\n    No = Show Stopper",null,null,null,null,null,{"$f":"IF(OR(COUNTBLANK('7-Capacity Plan'!$AR$11:$AR$40)=30,COUNTBLANK('7-Capacity Plan'!$AS$11:$AS$40)=30,COUNTBLANK('7-Capacity Plan'!$AK$11:$AK$40)=30,COUNTBLANK('7-Capacity Plan'!$AP$11:$AP$40)=30),\"\",IF(OR(COUNTIF('7-Capacity Plan'!$AR$11:$AR$40,\">100.1\")>0,COUNTIF('7-Capacity Plan'!$AK$11:$AK$40,\"Yes\")>0,COUNTIF('7-Capacity Plan'!$AS$11:$AS$40,\">120.1\")>0,COUNTIF('7-Capacity Plan'!$AP$11:$AP$40,\"Yes\")>0),\"Level 3\",IF(OR(COUNTIF('7-Capacity Plan'!$AS$11:$AS$40,\">120.1\")>0,COUNTIF('7-Capacity Plan'!$AP$11:$AP$40,\"HR\")>0),\"Level 2\",\"Level 0\")))","v":""}]
[null,18,"Can supplier meet all the timing milestones\n    Yes and all are Green - Level 0\n    Yes and 1 or more are Yellow - Level 3",null,null,null,null,null,{"$f":"IF(OR('10-Supplier Commitment'!B28=\"\",'10-Supplier Commitment'!B30=\"\",'10-Supplier Commitment'!B32=\"\",'10-Supplier Commitment'!B34=\"\"),\"\",IF(OR('10-Supplier Commitment'!B28>'1-Program Info'!B27,'10-Supplier Commitment'!B30>'1-Program Info'!B29,'10-Supplier Commitment'!B32>'1-Program Info'!B31,'10-Supplier Commitment'!B34>'1-Program Info'!B33),\"Level 3\",\"Level 0\"))","v":""}]
[null,19,"Dimensional or capability concerns identified on \"8-Process Controls\"\n    None - Level 1\n    Yes - Mitigation plans agreed to Level 2\n    Yes - Mitigation Plans still open - Level 3",null,null,null,null,null,{"$f":"IF(COUNTBLANK('8-Process Controls'!P6:P334)=329,\"\",IF(COUNTIF('8-Process Controls'!P6:P334,\"None\")>0,\"Level 3\",\"Level 0\"))","v":""}]
[null,20,"Open Issues Risk\n    All Open issues have approved Plan and Target Date - Level 0\n    Open Issues do not have an approved Plan or Target Date - Level 3",null,null,null,null,null,{"$f":"IF(COUNTA('9-Open Issues'!#REF!)=0,\"\",IF(OR(COUNTA('9-Open Issues'!#REF!)<COUNTA('9-Open Issues'!#REF!),COUNTA('9-Open Issues'!#REF!)<COUNTA('9-Open Issues'!#REF!)),\"Level 3\",\"Level 0\"))","v":"Level 0"}]
[null,21,"Print Release Level - Pull from the Program Info Tab\n    Production Release - Level 0\n    Change Control Release - Level 2\n    Developmental Drawing - Level 3",null,null,null,null,null,{"$f":"IF('1-Program Info'!D7=\"[Enter Print Release Level]\",\"\",IF('1-Program Info'!D7=\"Production Release\",\"Level 0\",IF('1-Program Info'!D7=\"Change Control Release\",\"Level 2\",\"Level 3\")))","v":""}]
[null,22,"Add: Special Process inhouse/outsourced (Heat treatment/coating/plating)\n    No = Level 0\n    Yes with CQI Audits complete = Level 2\n    Yes without CQI Audits = Level 3",null,null,null,null,null,{"$f":"IF('4-Technical Review'!E31=\"\",\"\",IF('4-Technical Review'!E31=\"No\",\"Level 0\",\"Level 3\"))","v":""}]
[null,23,"Outsourced special process at known sub-supplier or new subsupplier",null,null,null,null,null,{"$f":"IF('4-Technical Review'!E52=\"\",\"\",IF('4-Technical Review'!E52=\"Yes\",\"Level 0\",IF('4-Technical Review'!E53=\"No\",\"Level 1\",\"Level 3\")))","v":""}]
[null,24,"Laboratory on site or outsourced Identified laboratory able to perform all controls/checks",null,null,null,null,null,{"$f":"IF('4-Technical Review'!E33=\"\",\"\",IF('4-Technical Review'!E33=\"Yes\",\"Level 0\",\"Level 2\"))","v":""}]
[null,null,"DEFINITION OF RISK LEVELS"]
[null,null,"Definition: ","A risk is an uncertain event or a set of events which, if they occur, will have an effect on the achievement of objectives"]
[null,null,"Assessment: ","A risk is the combination of the probability of occurrence of a positive event (opportunity) or a negative event (threat) and its impact on the objectives of the project.  Based on our approach, the risk is seen as a threat."]
[null,null,"Probability","High","Level 1 : Minor","Level 3 : Critical"]
[null,null,null,null,"\u009fThe project can continue","\u009fProject obstacles certain"]
[null,null,null,null,"  \u009f Action plan recommended","  Escalation necessary"]
[null,null,null,"Low","Level 0 : Negligible or non-existent","Level 2 : Major"]
[null,null,null,null,null,"\u009fProject obstacles possible"]
[null,null,null,null,null,"  \u009f Action plan necessary"]
[null,null,null,null,"Low","High"]
[null,null,null,null,"Impact"]
[null,null,"Action Plan: ","Action plan should be documented in the open issues list"]
[]
[null,null,"RISK PROCESSING"]
[null,null,"Processing a risk does not necessarily mean eliminating it, but identifying it, anticipating it, accepting it, so that it can be shared and a well-informed decision can be taken."]
[null,null,"/!\\ A risk which becomes reality becomes a problem",null,null,null,null,{"$f":"IF(SUM($H$53:$H$56)=24,\"Excellent, assessment fully completed!\", \"Assessment Incomplete!\")","v":"Assessment Incomplete!"}]
[null,"Required Form"]
[null,null,"SUMMARY OF RISK LEVELS"]
[]
[null,null,"RISK LEVEL",null,null,null,null,"SCORE","Level of decision-making for information purposes"]
[null,null,"   Level 0: Negligible or non-existent risk",null,null,null,null,{"$f":"COUNTIF($I$9:$I$32,\"Level 0\")","v":1},"Nexteer: AQE, AQE Supervisor"]
[null,null,"   Level 1: Minor risk – The project can continue. Action plan recommended",null,null,null,null,{"$f":"COUNTIF($I$9:$I$32,\"Level 1\")","v":0},"Nexteer: AQE, AQE Supervisor, PLL"]
[null,null,"   Level 2: Major risk – obstacles possible. Action plan necessary",null,null,null,null,{"$f":"COUNTIF($I$9:$I$32,\"Level 2\")","v":1},"Nexteer: AQE, AQE Supervisor,  PLL, AQE Mgr, Prog Mgr"]
[null,null,"   Level 3: Critical risk – obstacles certain. Escalation necessary",null,null,null,null,{"$f":"COUNTIF($I$9:$I$32,\"Level 3\")","v":0},"Nexteer: AQE, AQE Supervisor,  PLL, AQE Mgr, Prog Mgr"]

{"sheet":"11-Risk Assessment (Int)","index":16,"n_rows":60,"n_cols":11,"rows_kept":60,"cut":false,"hidden":false,"merged":[[55,2,55,6],[55,8,55,9],[56,2,56,6],[56,8,56,9],[59,1,59,9],[0,1,0,9],[49,2,49,4],[52,2,52,6],[52,8,52,9],[53,2,53,6],[53,8,53,9],[31,9,32,9],[32,2,32,7],[33,1,33,9],[34,1,37,1],[34,2,34,7],[34,8,35,8],[34,9,35,9],[35,2,35,7],[26,9,27,9],[27,2,27,7],[54,2,54,6],[54,8,54,9],[36,9,37,9],[37,2,37,7],[40,3,40,9],[41,2,42,2],[44,4,44,5],[48,2,48,9],[36,2,36,7],[36,8,37,8],[28,1,28,9],[29,1,32,1],[29,2,29,7],[29,8,30,8],[29,9,30,9],[30,2,30,7],[31,2,31,7],[31,8,32,8],[23,1,23,9],[24,1,27,1],[24,2,24,7],[24,8,25,8],[24,9,25,9],[25,2,25,7],[26,2,26,7],[26,8,27,8],[18,1,18,9],[19,1,22,1],[19,2,19,7],[19,8,20,8],[19,9,20,9],[20,2,20,7],[21,2,21,7],[21,8,22,8],[21,9,22,9],[22,2,22,7],[13,1,13,9],[14,1,17,1],[14,2,14,7],[14,8,15,8],[14,9,15,9],[15,2,15,7],[16,2,16,7],[16,8,17,8],[16,9,17,9],[17,2,17,7],[7,1,7,2],[7,3,7,7],[8,1,8,9],[9,1,12,1],[9,2,9,7],[9,8,10,8],[9,9,10,9],[10,2,10,7],[11,2,11,7],[11,8,12,8],[11,9,12,9],[12,2,12,7],[5,1,5,2],[5,3,5,5],[5,8,5,9],[6,1,6,2],[6,3,6,5],[6,8,6,9],[3,1,3,2],[3,3,3,5],[3,8,3,9],[4,1,4,2],[4,3,4,5],[4,8,4,9],[1,1,1,2],[1,3,1,4],[1,6,1,8],[1,9,2,9],[2,1,2,2],[2,3,2,4],[2,6,2,8]]}
[null,"INTERNAL RISK ASSESSMENT"]
[null,"Part Number:",null,{"$f":"IF('1-Program Info'!B5=\"[Enter PN Here]\",\"\",'1-Program Info'!B5)","v":""},null,"Part Description:",{"$f":"IF('1-Program Info'!B3=\"[Enter Part Name Here]\",\"\",'1-Program Info'!B3)","v":""},null,null,{"$f":"IF($H$50=\"Assessment Incomplete!\",\"Assessment Incomplete!\",IF($H$57<>0,\"HIGH Internal Risk\",IF($H$56=0,\"LOW Internal Risk\",\"MEDIUM Internal Risk\")))","v":"Assessment Incomplete!"},{"$f":"SUM($K$9:$K$42)","v":0}]
[null,"Part Revision:",null,{"$f":"IF('1-Program Info'!B7=\"[Enter Drwg Rev Here]\",\"\",'1-Program Info'!B7)","v":""},null,"Program:",{"$f":"IF(ISBLANK('11-Risk Assessment (Ext)'!G3),\"\",'11-Risk Assessment (Ext)'!G3)","v":""}]
[null,"Team Participants",null,"Name",null,null,null,null,"Name"]
[null,"Buyer",null,{"$f":"'11-Risk Assessment (Ext)'!D5","v":"[Enter Buyer Name on Program Tab]"},null,null,null,"Product Engineering",{"$f":"'11-Risk Assessment (Ext)'!I5","v":"[Enter PE Name on Program Tab]"}]
[null,"Supplier Region AQE",null,{"$f":"'11-Risk Assessment (Ext)'!D6","v":"[Enter AQE Name on Program Tab]"},null,null,null,"Logistics"]
[null,"Program Manager",null,{"$f":"'11-Risk Assessment (Ext)'!D7","v":"[Enter Program Manager Name on Program Tab]"},null,null,null,"Optional - Quality / Mfg Eng"]
[null,"Risk Category",null,"Risk Factor",null,null,null,null,"Assessment","Comments"]
[null," CUSTOMER"]
[null,null,"What is the level of risk associated to the customer?",null,null,null,null,null,null,null,{"$f":"IF($I10=\"\",\"\",_xlfn.SWITCH($I10,\"Level 0\",1,\"Level 1\",5,\"Level 2\",10,\"Level 3\",20))","v":""}]
[null,null,"Existing customer, existing and previously validated product = Level 0\nExisting customer, minor product change (no new technology, no new process, limited validation impact) = Level 1\nNew product with existing customer OR new customer with existing and previously validated product = Level 2\nNew customer AND new product = Level 3"]
[null,null,"What is the level of risk regarding a customer that is extremely demanding and time consuming?\n"]
[null,null,"Occasional contact, standardaized communication = Level 0\nRegular contact, structured and predictable = Level 1 \nFrequent contact, multiple interfaces involved = Level 2\nFrequent, unstructured contact with unclear escalation = Level 3",null,null,null,null,null,null,null,{"$f":"IF($I13=\"\",\"\",_xlfn.SWITCH($I13,\"Level 0\",1,\"Level 1\",5,\"Level 2\",10,\"Level 3\",20))","v":""}]
[null," PROGRAM"]
[null,null,"What is the level of risk concerning the volume ramp?",null,null,null,null,null,null,null,""]
[null,null,"Controlled (Gradual, tightly controlled volume increase) = Level 0\nStepwise (Planned step increases with stabilization gaps) = Level 1\nAggressive (Rapid ramp-up with limited stabilization time) = Level 2\nImmediate full volume (Full production volume from SOP) = Level 3"]
[null,null,"What is the level of risk associated to a short lead time for program development?",null,null,null,null,null,null,null,""]
[null,null,"Negligible Risk, >2 years program lead time = Level 0\nMinor Risk, 1.5-2 years program lead time = Level 1\nMajor Risk, 1-1.5 years program lead time = Level 2\nCritical Risk, <1 year program lead time = Level 3\n  (note: May be reduced to Level 2 for Fasteners & Springs, Rubber, Chemicals, Labels, Raw Material, Outside Processes, Tubing)"]
[null," SPECIFICATIONS"]
[null,null,"What is the level of risk at Nexteer to modify the system, the part or some others elements?",null,null,null,null,null,null,null,""]
[null,null,"No design change risk (Design is unchanged and has been previously validated; no additional validation required) = Level 0\nLimited design change (Design change is minor and requires limited validation (e.g. partial testing or analysis) only) = Level 1\nSignificant design change (Design change is significant and requires extended or re-validation of selected requirements) = Level 2\nNew or Major Redesign (New design or major redesign requiring full validation and qualification) = Level 3"]
[null,null,"What is the level of risk at OEM / final customer to change their requirements?",null,null,null,null,null,null,null,""]
[null,null,"OEM requirements are fully released and stable = Level 0\nMinor open points with low impact = Level 1\nIncomplete requirements with defined assumptions = Level 2\nDraft or missing requirements with high functional impact = Level 3"]
[null," TECHNOLOGY"]
[null,null,"What is the level of risk to not pass validation test first time?",null,null,null,null,null,null,null,""]
[null,null,"Technology proven by production-representative prototype testing = Level 0\nTechnology partially validated with no critical gaps = Level 1\nTechnology in trial phase with limited validation = Level 2\nTechnology unvalidated or with previous validation failures = Level 3"]
[null,null,"What is the level of risk at Nexteer regarding in-house experience with the chosen technology or design concept?",null,null,null,null,null,null,null,""]
[null,null,"Proven in-house experience with multiple prior applications = Level 0\nLimited in-house experience supported by experts = Level 1\nExperience under acquisition with defined training plan = Level 2\nNo in-house experience yet = Level 3"]
[null," COMPLEXITY AND INTERFACES"]
[null,null,"What is the level of risk regarding the technical environment (rust, contamination, migration, …)?",null,null,null,null,null,null,null,""]
[null,null,"Requirements quantified, realistic and standardized = Level 0\nRequirements defined with minor open points = Level 1\nRequirements partially define or under discussion = Level 2\nRequirements vague, unrealistic, or untestable = Level 3"]
[null,null,"What is the level of risk related to pass-through characteristics and customer interface visibility?",null,null,null,null,null,null,null,""]
[null,null,"No pass through characteristics exist for the part or system = Level 0\nPass-through characteristics exist, are clearly identified on the drawing/specification = Level 1\nPass-through characteristics are identified but Nexteer does not directly interface with or control them = Level 2\nPass-through characteristics exist but are not identified on the drawing/specification = Level 3"]
[null," RELIABILITY AND SAFETY"]
[null,null,"What is the level of risk for available or future safety restriction on material?",null,null,null,null,null,null,null,""]
[null,null,"No requirements or regulations impacted = Level 0\nRaw material transfer from one region to another or local regulations are taken into account by project team = Level 1\nPartially taken into account = Level 2\nNot managed = Level 3"]
[null,null,"What is the level of risk regarding safety critical part definition (impossible to measure directly or at 100%, except with X1331)?",null,null,null,null,null,null,null,""]
[null,null,"Part without Severity 9 or 10 characteristics = Level 0\nPart with CL3 characteristics or CL1/CL2 characteristics that are 100% directly measureable = Level 1\nPart with CL1 and CL2 characteristics that are 100% indirectly controlled, e.g. through 100% monitoring of process parameters = Level 2\nSafety critical part as defined by Severity 9 or 10, with an approved alternative control strategy in accordance with G1331 (X1331) = Level 3"]
[null,null,"DEFINITION OF RISK LEVELS"]
[null,null,"Definition: ","A risk is an uncertain event or a set of events which, if they occur, will have an effect on the achievement of objectives"]
[null,null,"Assessment: ","A risk is the combination of the probability of occurrence of a positive event (opportunity) or a negative event (threat) and its impact on the objectives of the project.  Based on our approach, the risk is seen as a threat."]
[null,null,"Probability","High","Level 1 : Minor\n\u009fThe project can continue\n  \u009f Action plan recommended","Level 3 : Critical\n\u009fProject obstacles certain\n  Escalation required"]
[null,null,null,"Low","Level 0 : Negligible or non-existent","Level 2 : Major\n\u009fProject obstacles possible\n  \u009f Action plan required"]
[null,null,null,null,"Low","High"]
[null,null,null,null,"Impact"]
[null,null,"Action Plan: ","Action plan should be documented in the open issues list"]
[]
[null,null,"RISK PROCESSING"]
[null,null,"Processing a risk does not necessarily mean eliminating it, but identifying it, anticipating it, accepting it, so that it can be shared and a well-informed decision can be taken."]
[null,null,"/!\\ A risk which becomes reality becomes a problem",null,null,null,null,{"$f":"IF(SUM($H$54:$H$57)=12,\"Excellent, assessment fully completed!\", \"Assessment Incomplete!\")","v":"Assessment Incomplete!"}]
[null,null,"SUMMARY OF RISK LEVELS"]
[]
[null,null,"RISK LEVEL",null,null,null,null,"SCORE","Level of decision-making for information purposes"]
[null,null,"   Level 0: Negligible or non-existent risk",null,null,null,null,{"$f":"COUNTIF($I$10:$I$37,\"Level 0\")","v":0},"Nexteer: AQE, AQE Supervisor"]
[null,null,"   Level 1: Minor risk – The project can continue. Action plan recommended",null,null,null,null,{"$f":"COUNTIF($I$10:$I$37,\"Level 1\")","v":0},"Nexteer: AQE, AQE Supervisor, PLL"]
[null,null,"   Level 2: Major risk – obstacles possible. Action plan necessary",null,null,null,null,{"$f":"COUNTIF($I$10:$I$37,\"Level 2\")","v":0},"Nexteer: AQE, AQE Supervisor,  PLL, AQE Mgr, Prog Mgr"]
[null,null,"   Level 3: Critical risk – obstacles certain. Escalation necessary",null,null,null,null,{"$f":"COUNTIF($I$10:$I$37,\"Level 3\")","v":0},"Nexteer: AQE, AQE Supervisor,  PLL, AQE Mgr, Prog Mgr"]
[]
[]
[null,"Required Form"]

{"sheet":"Final Risk Assessment","index":17,"n_rows":18,"n_cols":9,"rows_kept":18,"cut":false,"hidden":true,"merged":[[17,1,17,8],[3,1,3,8],[6,7,6,8],[7,7,7,8],[8,7,8,8],[9,7,9,8],[10,7,10,8],[1,1,1,2],[1,3,1,4],[1,6,1,7],[1,8,2,8],[2,1,2,2],[2,3,2,4],[2,6,2,7]]}
[]
[null,"Part Number:",null,{"$f":"IF('1-Program Info'!B5=\"[Enter PN Here]\",\"\",'1-Program Info'!B5)","v":""},null,"Part Description:",{"$f":"IF('1-Program Info'!B3=\"[Enter Part Name Here]\",\"\",'1-Program Info'!B3)","v":""},null,{"$f":"G16","v":"Assessment Incomplete!"}]
[null,"Part Revision:",null,{"$f":"IF('1-Program Info'!B7=\"[Enter Drwg Rev Here]\",\"\",'1-Program Info'!B7)","v":""},null,"Program:",{"$f":"IF(ISBLANK('11-Risk Assessment (Ext)'!G3),\"\",'11-Risk Assessment (Ext)'!G3)","v":""}]
[]
[null,null,"SUMMARY OF FINAL RISK ASSESSMENT"]
[]
[null,null,null,null,"INTERNAL RISK ASSESSMENT","EXTERNAL RISK ASSESSMENT","FINAL RISK ASSESSMENT","Level of decision-making for information purposes"]
[null,null,null,null,"N/A","HIGH","HIGH","Nexteer: AQE, AQE Supervisor,  PLL, AQE Mgr, Prog Mgr"]
[null,null,null,null,"HIGH","N/A","HIGH","Nexteer: AQE, AQE Supervisor,  PLL, AQE Mgr, Prog Mgr"]
[null,null,null,null,"MEDIUM","MEDIUM","MEDIUM","Nexteer: AQE, AQE Supervisor, PLL"]
[null,null,null,null,"LOW","LOW","LOW","Nexteer: AQE, AQE Supervisor"]
[]
[null,null,"SUMMARY OF FINAL RISK"]
[]
[null,null,null,null,"INTERNAL RISK ASSESSMENT","EXTERNAL RISK ASSESSMENT","FINAL ASSESSMENT"]
[null,null,null,null,{"$f":"'11-Risk Assessment (Int)'!J2","v":"Assessment Incomplete!"},{"$f":"'11-Risk Assessment (Ext)'!J2","v":"Assessment Incomplete!"},{"$f":"IF(OR($E$16=\"Assessment Incomplete!\",$F$16=\"Assessment Incomplete!\"),\"Assessment Incomplete!\",IF(OR($E$16=\"HIGH Internal Risk\",$F$16=\"HIGH External Risk\"),\"HIGH APQP Risk\",IF(OR($E$16=\"MEDIUM Internal Risk\",$F$16=\"MEDIUM External Risk\"),\"MEDIUM APQP Risk\",\"LOW APQP Risk\")))","v":"Assessment Incomplete!"}]
[]
[null,"Required Form"]

{"sheet":"Coating & Plating","index":18,"n_rows":57,"n_cols":27,"rows_kept":57,"cut":false,"hidden":true,"merged":[[12,3,12,5],[2,3,2,5],[3,3,3,5],[4,3,4,5],[5,3,5,5],[6,3,6,5],[7,3,7,5],[8,3,8,5],[9,3,9,5],[10,3,10,5],[11,3,11,5],[24,3,24,5],[13,3,13,5],[14,3,14,5],[15,3,15,5],[16,3,16,5],[17,3,17,5],[18,3,18,5],[19,3,19,5],[20,3,20,5],[21,3,21,5],[22,3,22,5],[23,3,23,5],[36,3,36,5],[25,3,25,5],[26,3,26,5],[27,3,27,5],[28,3,28,5],[29,3,29,5],[30,3,30,5],[31,3,31,5],[32,3,32,5],[33,3,33,5],[34,3,34,5],[35,3,35,5],[38,3,38,5],[39,3,39,5],[40,3,40,5],[41,3,41,5],[42,3,42,5],[55,3,55,5],[56,3,56,5],[0,2,0,8],[49,3,49,5],[50,3,50,5],[51,3,51,5],[52,3,52,5],[53,3,53,5],[54,3,54,5],[43,3,43,5],[44,3,44,5],[45,3,45,5],[46,3,46,5],[47,3,47,5],[48,3,48,5],[37,3,37,5]]}
[null,null,"Coating & Plating Technical Supplement",null,null,null,null,null,null,null,null,null,null,null,null,null,null,null,null,null,null,null,null,null,{"$f":"'1-Program Info'!L47","v":"No"},{"$f":"'1-Program Info'!L48","v":"No"},{"$f":"IF(OR(Z1=\"Yes\",Y1=\"Yes\"),\"Yes\",\"No\")","v":"No"}]
[]
["Item #","Nexteer Requirement","Supplier Response","Supplier Comments",null,null,"Mitigation Plan","Mitigation Plan Owner","Status\n(Nexteer AQE/SQE)"]
[1,"Are you familiar with the OEM's specifications?",null,null,null,null,null,null,null,null,null,null,null,null,null,null,null,null,null,null,null,null,null,null,null,null,{"$f":"IF($AA$1=\"Yes\",IF(OR(ISBLANK(I4),I4=\"Open\"),\"R\",IF(I4=\"Mitigation Plan Approved\",\"Y\",\"G\")),\"\")","v":""}]
[2,"Do you certify each lot of material will meet these specifications?",null,null,null,null,null,null,null,null,null,null,null,null,null,null,null,null,null,null,null,null,null,null,null,null,{"$f":"IF($AA$1=\"Yes\",IF(OR(ISBLANK(I5),I5=\"Open\"),\"R\",IF(I5=\"Mitigation Plan Approved\",\"Y\",\"G\")),\"\")","v":""}]
[3,"What finishing specification can you adhere to?",null,null,null,null,null,null,null,null,null,null,null,null,null,null,null,null,null,null,null,null,null,null,null,null,""]
[4,"Is the lab you use certified? To what certification?",null,null,null,null,null,null,null,null,null,null,null,null,null,null,null,null,null,null,null,null,null,null,null,null,""]
[5,"How often do you send parts out for certification?",null,null,null,null,null,null,null,null,null,null,null,null,null,null,null,null,null,null,null,null,null,null,null,null,""]
[6,"What type of cleaning process do you utilize?",null,null,null,null,null,null,null,null,null,null,null,null,null,null,null,null,null,null,null,null,null,null,null,null,""]
[7,"Do you utilize automatic processing equipment?",null,null,null,null,null,null,null,null,null,null,null,null,null,null,null,null,null,null,null,null,null,null,null,null,""]
[8,"Are temperature controllers automatic? ",null,null,null,null,null,null,null,null,null,null,null,null,null,null,null,null,null,null,null,null,null,null,null,null,""]
[9,"What internal testing capabilities do you have for:",null,null,null,null,null,null,null,null,null,null,null,null,null,null,null,null,null,null,null,null,null,null,null,null,""]
["9a","Chemical concentrations",null,null,null,null,null,null,null,null,null,null,null,null,null,null,null,null,null,null,null,null,null,null,null,null,""]
["9b","Bath temperatures",null,null,null,null,null,null,null,null,null,null,null,null,null,null,null,null,null,null,null,null,null,null,null,null,""]
["9c","Oven/furnace temperatures",null,null,null,null,null,null,null,null,null,null,null,null,null,null,null,null,null,null,null,null,null,null,null,null,""]
["9d","Product thickness",null,null,null,null,null,null,null,null,null,null,null,null,null,null,null,null,null,null,null,null,null,null,null,null,""]
["9e","Adhesion",null,null,null,null,null,null,null,null,null,null,null,null,null,null,null,null,null,null,null,null,null,null,null,null,""]
["9f","Salt Spray",null,null,null,null,null,null,null,null,null,null,null,null,null,null,null,null,null,null,null,null,null,null,null,null,""]
["9g","Coating weight",null,null,null,null,null,null,null,null,null,null,null,null,null,null,null,null,null,null,null,null,null,null,null,null,""]
[10,"Do you have calibration procedures for all test equipment?",null,null,null,null,null,null,null,null,null,null,null,null,null,null,null,null,null,null,null,null,null,null,null,null,""]
[11,"Is your equipment calibrated using NIST traceable standards?",null,null,null,null,null,null,null,null,null,null,null,null,null,null,null,null,null,null,null,null,null,null,null,null,""]
[12,"Are your calibration records available for the last twelve months?",null,null,null,null,null,null,null,null,null,null,null,null,null,null,null,null,null,null,null,null,null,null,null,null,""]
[13,"Are process control charts (i.e., trend charts) used as tool to control the process?",null,null,null,null,null,null,null,null,null,null,null,null,null,null,null,null,null,null,null,null,null,null,null,null,""]
[14,"How do you record the data?",null,null,null,null,null,null,null,null,null,null,null,null,null,null,null,null,null,null,null,null,null,null,null,null,""]
[15,"Can your operators interpret the method of recording the data?",null,null,null,null,null,null,null,null,null,null,null,null,null,null,null,null,null,null,null,null,null,null,null,null,""]
[16,"Who reviews the data and how often?",null,null,null,null,null,null,null,null,null,null,null,null,null,null,null,null,null,null,null,null,null,null,null,null,""]
[17,"Do you have a written process specification?",null,null,null,null,null,null,null,null,null,null,null,null,null,null,null,null,null,null,null,null,null,null,null,null,""]
[18,"Does the specification describe the current process?",null,null,null,null,null,null,null,null,null,null,null,null,null,null,null,null,null,null,null,null,null,null,null,null,""]
[19,"How do you communicate changes to specifications within your organization?",null,null,null,null,null,null,null,null,null,null,null,null,null,null,null,null,null,null,null,null,null,null,null,null,""]
[20,"Are you aware that ANY changes to the process must be pre-approved by Nexteer?",null,null,null,null,null,null,null,null,null,null,null,null,null,null,null,null,null,null,null,null,null,null,null,null,""]
[21,"Do you have an equipment preventive maintenance program?",null,null,null,null,null,null,null,null,null,null,null,null,null,null,null,null,null,null,null,null,null,null,null,null,""]
[22,"Does the PM specify frequency and requirements?",null,null,null,null,null,null,null,null,null,null,null,null,null,null,null,null,null,null,null,null,null,null,null,null,""]
[23,"Does the PM include calibration for pyrometers and testing equipment?",null,null,null,null,null,null,null,null,null,null,null,null,null,null,null,null,null,null,null,null,null,null,null,null,""]
[24,"How often are consumable tanks replaced?",null,null,null,null,null,null,null,null,null,null,null,null,null,null,null,null,null,null,null,null,null,null,null,null,""]
[25,"How is this determined when consumable tanks should be replaced?",null,null,null,null,null,null,null,null,null,null,null,null,null,null,null,null,null,null,null,null,null,null,null,null,""]
[26,"How often are process tanks cleaned?",null,null,null,null,null,null,null,null,null,null,null,null,null,null,null,null,null,null,null,null,null,null,null,null,""]
[27,"Are there records to verify tank cleaning?",null,null,null,null,null,null,null,null,null,null,null,null,null,null,null,null,null,null,null,null,null,null,null,null,""]
[28,"Is there a plan to identify and contain material in process for equipment malfunctions?",null,null,null,null,null,null,null,null,null,null,null,null,null,null,null,null,null,null,null,null,null,null,null,null,""]
[29,"Is there a procedure to contain non-conforming material?",null,null,null,null,null,null,null,null,null,null,null,null,null,null,null,null,null,null,null,null,null,null,null,null,""]
[30,"Is everyone aware of the material specification?",null,null,null,null,null,null,null,null,null,null,null,null,null,null,null,null,null,null,null,null,null,null,null,null,""]
[31,"Is there a clearly identified containment area? Is it under lock and key?",null,null,null,null,null,null,null,null,null,null,null,null,null,null,null,null,null,null,null,null,null,null,null,null,""]
[32,"Who has the key to the containment area?",null,null,null,null,null,null,null,null,null,null,null,null,null,null,null,null,null,null,null,null,null,null,null,null,""]
[33,"How is scrap identified and disposed from the process?",null,null,null,null,null,null,null,null,null,null,null,null,null,null,null,null,null,null,null,null,null,null,null,null,""]
[34,"How is material identified at all steps in the process? - especially incoming mat'l?",null,null,null,null,null,null,null,null,null,null,null,null,null,null,null,null,null,null,null,null,null,null,null,null,""]
[35,"How often is material inspected during the process?",null,null,null,null,null,null,null,null,null,null,null,null,null,null,null,null,null,null,null,null,null,null,null,null,""]
[36,"What parameters are monitored? Who does the monitoring?",null,null,null,null,null,null,null,null,null,null,null,null,null,null,null,null,null,null,null,null,null,null,null,null,""]
[37,"Are job instruction guides posted for each task in the process?",null,null,null,null,null,null,null,null,null,null,null,null,null,null,null,null,null,null,null,null,null,null,null,null,""]
[38,"Is there a training program documented?",null,null,null,null,null,null,null,null,null,null,null,null,null,null,null,null,null,null,null,null,null,null,null,null,""]
[39,"Are training records available?",null,null,null,null,null,null,null,null,null,null,null,null,null,null,null,null,null,null,null,null,null,null,null,null,""]
[40,"Are there regular employee meetings held?",null,null,null,null,null,null,null,null,null,null,null,null,null,null,null,null,null,null,null,null,null,null,null,null,""]
[41,"How are changes communicated to all employees?",null,null,null,null,null,null,null,null,null,null,null,null,null,null,null,null,null,null,null,null,null,null,null,null,""]
[42,"Do you have a contingency plan in place for equipment failure?",null,null,null,null,null,null,null,null,null,null,null,null,null,null,null,null,null,null,null,null,null,null,null,null,""]
[43,"Have you received any environmental violations?",null,null,null,null,null,null,null,null,null,null,null,null,null,null,null,null,null,null,null,null,null,null,null,null,""]
[44,"How do you dispose of hazardous waste?",null,null,null,null,null,null,null,null,null,null,null,null,null,null,null,null,null,null,null,null,null,null,null,null,""]
[45,"Can the supplier that disposes hazardous waste be contacted?",null,null,null,null,null,null,null,null,null,null,null,null,null,null,null,null,null,null,null,null,null,null,null,null,""]
[46,"What municipality do you discharge to?",null,null,null,null,null,null,null,null,null,null,null,null,null,null,null,null,null,null,null,null,null,null,null,null,""]
[47,"Can the municipality be contacted?",null,null,null,null,null,null,null,null,null,null,null,null,null,null,null,null,null,null,null,null,null,null,null,null,""]

{"sheet":"Diecast Aluminum & Magnesium","index":19,"n_rows":64,"n_cols":27,"rows_kept":64,"cut":false,"hidden":true,"merged":[[7,3,7,5],[2,3,2,5],[3,3,3,5],[4,3,4,5],[5,3,5,5],[6,3,6,5],[19,3,19,5],[8,3,8,5],[9,3,9,5],[10,3,10,5],[11,3,11,5],[12,3,12,5],[13,3,13,5],[14,3,14,5],[15,3,15,5],[16,3,16,5],[17,3,17,5],[18,3,18,5],[31,3,31,5],[20,3,20,5],[21,3,21,5],[22,3,22,5],[23,3,23,5],[24,3,24,5],[25,3,25,5],[26,3,26,5],[27,3,27,5],[28,3,28,5],[29,3,29,5],[30,3,30,5],[43,3,43,5],[32,3,32,5],[33,3,33,5],[34,3,34,5],[35,3,35,5],[36,3,36,5],[37,3,37,5],[38,3,38,5],[39,3,39,5],[40,3,40,5],[41,3,41,5],[42,3,42,5],[45,3,45,5],[46,3,46,5],[47,3,47,5],[48,3,48,5],[49,3,49,5],[62,3,62,5],[63,3,63,5],[0,2,0,8],[56,3,56,5],[57,3,57,5],[58,3,58,5],[59,3,59,5],[60,3,60,5],[61,3,61,5],[50,3,50,5],[51,3,51,5],[52,3,52,5],[53,3,53,5],[54,3,54,5],[55,3,55,5],[44,3,44,5]]}
[null,null,"Diecast Aluminum & Magnesium Technical Supplement",null,null,null,null,null,null,null,null,null,null,null,null,null,null,null,null,null,null,null,null,null,null,null,{"$f":"'1-Program Info'!L11","v":"No"}]
[]
["Item #","Nexteer Requirement","Supplier Response","Supplier Comments",null,null,"Mitigation Plan","Mitigation Plan Owner","Status\n(Nexteer AQE/SQE)"]
[1,"Is there a possibility of mixing alloys in this facility? How do you segregate the alloys to prevent a mix?",null,null,null,null,null,null,null,null,null,null,null,null,null,null,null,null,null,null,null,null,null,null,null,null,{"$f":"IF($AA$1=\"Yes\",IF(OR(ISBLANK(I4),I4=\"Open\"),\"R\",IF(I4=\"Mitigation Plan Approved\",\"Y\",\"G\")),\"\")","v":""}]
[2,"How is charge and re-melt segregated?",null,null,null,null,null,null,null,null,null,null,null,null,null,null,null,null,null,null,null,null,null,null,null,null,{"$f":"IF($AA$1=\"Yes\",IF(OR(ISBLANK(I5),I5=\"Open\"),\"R\",IF(I5=\"Mitigation Plan Approved\",\"Y\",\"G\")),\"\")","v":""}]
[3,"How is incoming material checked? Is it certified?",null,null,null,null,null,null,null,null,null,null,null,null,null,null,null,null,null,null,null,null,null,null,null,null,""]
[4,"What type of melting furnace is used and how many? How is the temperature and chemistry controlled?",null,null,null,null,null,null,null,null,null,null,null,null,null,null,null,null,null,null,null,null,null,null,null,null,""]
[5,"How is the metal transferred to a holding furnace at the diecast machines (ladle, launder, etc.)?",null,null,null,null,null,null,null,null,null,null,null,null,null,null,null,null,null,null,null,null,null,null,null,null,""]
[6,"How is the chemistry checked at the holding furnace? Whatis the frequency?",null,null,null,null,null,null,null,null,null,null,null,null,null,null,null,null,null,null,null,null,null,null,null,null,""]
[7,"How is the microstructure checked? Are the lab and operator(s) qualified?",null,null,null,null,null,null,null,null,null,null,null,null,null,null,null,null,null,null,null,null,null,null,null,null,""]
[8,"How are mechanical properties checked? Are test bars cast or machined? Is data stored and readily available?",null,null,null,null,null,null,null,null,null,null,null,null,null,null,null,null,null,null,null,null,null,null,null,null,""]
[9,"How are casting lots defined? Nexteer requires one shift maximum",null,null,null,null,null,null,null,null,null,null,null,null,null,null,null,null,null,null,null,null,null,null,null,null,""]
[10,"How is melt de-gassed/fluxed? How is the process verified i.e. density check, sectioning?",null,null,null,null,null,null,null,null,null,null,null,null,null,null,null,null,null,null,null,null,null,null,null,null,""]
[11,"How is metal transferred to diecast machine shot sleeve (ladle, pump, etc.)? What is done to minimize inclusions?",null,null,null,null,null,null,null,null,null,null,null,null,null,null,null,null,null,null,null,null,null,null,null,null,""]
[12,"What type of diecast machine will be used - horizontal or vertical / cold or hot chamber? ",null,null,null,null,null,null,null,null,null,null,null,null,null,null,null,null,null,null,null,null,null,null,null,null,""]
["12a","Do you plan on doing a partial PPAP (X-ray samples/strength testing if applicable/EPC) for each diecast machine used?",null,null,null,null,null,null,null,null,null,null,null,null,null,null,null,null,null,null,null,null,null,null,null,null,""]
[13,"What tonnage diecast machine will be used? ",null,null,null,null,null,null,null,null,null,null,null,null,null,null,null,null,null,null,null,null,null,null,null,null,""]
["13a","What is max. shot intensification pressure / cavity pressure?",null,null,null,null,null,null,null,null,null,null,null,null,null,null,null,null,null,null,null,null,null,null,null,null,""]
["13b","Provide calculation for machine size.",null,null,null,null,null,null,null,null,null,null,null,null,null,null,null,null,null,null,null,null,null,null,null,null,""]
["13c","Provide PQ^2 chart.",null,null,null,null,null,null,null,null,null,null,null,null,null,null,null,null,null,null,null,null,null,null,null,null,""]
[14,"Is the machine fully automated such as metal ladling, die lube, casting extraction and trim?",null,null,null,null,null,null,null,null,null,null,null,null,null,null,null,null,null,null,null,null,null,null,null,null,""]
["14a","For the die lube application is a fixed manifold or flexible nozzles used?",null,null,null,null,null,null,null,null,null,null,null,null,null,null,null,null,null,null,null,null,null,null,null,null,""]
["14b","Is key equipment, such as inserts, spraying system, water, oil, air, electric lines, considered inside preventive maintenance?",null,null,null,null,null,null,null,null,null,null,null,null,null,null,null,null,null,null,null,null,null,null,null,null,""]
["14c","Are shot parameters monitored i.e. cycle time, slow shot velocity, fast shot velocity, intensification pressure, biscuit length, slow shot distance, and intensification rise time?",null,null,null,null,null,null,null,null,null,null,null,null,null,null,null,null,null,null,null,null,null,null,null,null,""]
["14d","For critical shot part parameters out of specification is the shot automatically scrapped? Is there a limit set to stop the process for continuous rejects?",null,null,null,null,null,null,null,null,null,null,null,null,null,null,null,null,null,null,null,null,null,null,null,null,""]
["14e","How many shots are auto discarded for cold shots at the start of the process? How many shots are auto discarded for significant stoppages? How were these numbers arrived at?",null,null,null,null,null,null,null,null,null,null,null,null,null,null,null,null,null,null,null,null,null,null,null,null,""]
["14f","Are castings water quenched or ait cooled prior to trimming?",null,null,null,null,null,null,null,null,null,null,null,null,null,null,null,null,null,null,null,null,null,null,null,null,""]
["14g","Describe your mold release agent application system and controls.",null,null,null,null,null,null,null,null,null,null,null,null,null,null,null,null,null,null,null,null,null,null,null,null,""]
["14h","After shot extraction from the mold is the presence of the vents, runner system & cavities checked on the shot so as not to damage the mold in the next shot? If not present is the diecast machine automatically shut down?",null,null,null,null,null,null,null,null,null,null,null,null,null,null,null,null,null,null,null,null,null,null,null,null,""]
[15,"How is biscuit length controlled?",null,null,null,null,null,null,null,null,null,null,null,null,null,null,null,null,null,null,null,null,null,null,null,null,""]
[16,"Do you have vacuum assist capability? Will it be applied to this part?",null,null,null,null,null,null,null,null,null,null,null,null,null,null,null,null,null,null,null,null,null,null,null,null,""]
[17,"Do you have squeeze pin capability? Will it be applied to this part?",null,null,null,null,null,null,null,null,null,null,null,null,null,null,null,null,null,null,null,null,null,null,null,null,""]
[18,"Are dies designed and built in house or outside?",null,null,null,null,null,null,null,null,null,null,null,null,null,null,null,null,null,null,null,null,null,null,null,null,""]
["18a","If outside what type of die certification (material, heat treatment & dimensional) do you get from the die shop?",null,null,null,null,null,null,null,null,null,null,null,null,null,null,null,null,null,null,null,null,null,null,null,null,""]
[19,"Do you have a die concept design and has it been reviewed for manufacturablity / durability prior to build?",null,null,null,null,null,null,null,null,null,null,null,null,null,null,null,null,null,null,null,null,null,null,null,null,""]
[20,"Has the casting machined finish stock been reviewed and optimized for minimum amount to reduce exposed porosity?",null,null,null,null,null,null,null,null,null,null,null,null,null,null,null,null,null,null,null,null,null,null,null,null,""]
[21,"What die material is used? What is the expected die life in shots?",null,null,null,null,null,null,null,null,null,null,null,null,null,null,null,null,null,null,null,null,null,null,null,null,""]
[22,"How many dies and cavities per die are planned? How many slides and core pulls?",null,null,null,null,null,null,null,null,null,null,null,null,null,null,null,null,null,null,null,null,null,null,null,null,""]
[23,"How many net pieces per day are expected for one die / machine?",null,null,null,null,null,null,null,null,null,null,null,null,null,null,null,null,null,null,null,null,null,null,null,null,""]
[24,"What casting identification will be on the part (cavity number, shift, date etc.)?",null,null,null,null,null,null,null,null,null,null,null,null,null,null,null,null,null,null,null,null,null,null,null,null,""]
[25,"Are you planning on using core interlocks? Are you planning on inserting any areas of the mold for PM purposes?",null,null,null,null,null,null,null,null,null,null,null,null,null,null,null,null,null,null,null,null,null,null,null,null,""]
[26,"What simulation reports are you doing for this part? i.e. mold filling gare velocity plots & animation, temperature plots & animation, air pressure/entrapment plots, fraction solid plots & aniimaiton, porosity plots, solidification time plots, evidence that casting  anomalies/residual tensile stresses do not overlay FEA high stress regions and evidence that casting distortion plots do not result in dimensional non-conformances.",null,null,null,null,null,null,null,null,null,null,null,null,null,null,null,null,null,null,null,null,null,null,null,null,""]
[27,"Are gate, ejector pins and vent locations defined?",null,null,null,null,null,null,null,null,null,null,null,null,null,null,null,null,null,null,null,null,null,null,null,null,""]
[28,"What type of die cooling system is used (water, oil or combined)? If water is used is it treated? What type of die temperature methods / controls are used? Are flow meters used in each water line?",null,null,null,null,null,null,null,null,null,null,null,null,null,null,null,null,null,null,null,null,null,null,null,null,""]
[29,"How is tooling managed? What are the typical number of shots for inspection, re-furbish and replacement molds? How were replacement dies quoted?",null,null,null,null,null,null,null,null,null,null,null,null,null,null,null,null,null,null,null,null,null,null,null,null,""]
[30,"For all dies utilizing gage elements (i.e. balls or cones), is the die inserted in these areas to provide for easy maintenance?",null,null,null,null,null,null,null,null,null,null,null,null,null,null,null,null,null,null,null,null,null,null,null,null,""]
[31,"Do you have x-ray capability in house? If done on the outside what is the frequency and turn around time?",null,null,null,null,null,null,null,null,null,null,null,null,null,null,null,null,null,null,null,null,null,null,null,null,""]
["31a","Are you planning on using it during the development of the PPAP process?",null,null,null,null,null,null,null,null,null,null,null,null,null,null,null,null,null,null,null,null,null,null,null,null,""]
["31b","Are you going to use it in production?",null,null,null,null,null,null,null,null,null,null,null,null,null,null,null,null,null,null,null,null,null,null,null,null,""]
["31c","Are operator(s) certified to a standard i.e. NA ASNT-TC-1A or EN 45013 and EN 473?",null,null,null,null,null,null,null,null,null,null,null,null,null,null,null,null,null,null,null,null,null,null,null,null,""]
["31d","Describe your plan for the image settings and porosity detection.",null,null,null,null,null,null,null,null,null,null,null,null,null,null,null,null,null,null,null,null,null,null,null,null,""]
["31e","Do you have image retention capability?",null,null,null,null,null,null,null,null,null,null,null,null,null,null,null,null,null,null,null,null,null,null,null,null,""]
[33,"Do you have stress relieve/heat treating capability in house or outside?",null,null,null,null,null,null,null,null,null,null,null,null,null,null,null,null,null,null,null,null,null,null,null,null,""]
[34,"Do you have shot blast capability? Was it included in the quote?",null,null,null,null,null,null,null,null,null,null,null,null,null,null,null,null,null,null,null,null,null,null,null,null,""]
[35,"Do you have leak test capability (air decay, water dunk) with a master? Was it included in the quote for this part if applicable?",null,null,null,null,null,null,null,null,null,null,null,null,null,null,null,null,null,null,null,null,null,null,null,null,""]
[36,"Are you planning on using impregnation in your process? If yes, why?",null,null,null,null,null,null,null,null,null,null,null,null,null,null,null,null,null,null,null,null,null,null,null,null,""]
[37,"Are there scrap reconciliation records for the entire process?",null,null,null,null,null,null,null,null,null,null,null,null,null,null,null,null,null,null,null,null,null,null,null,null,""]
[38,"Are you planning on doing a DOE to optimize the critical shot parameters for this part?",null,null,null,null,null,null,null,null,null,null,null,null,null,null,null,null,null,null,null,null,null,null,null,null,""]
["38a","Are you planning on doing a verification run on shot parameter limits?",null,null,null,null,null,null,null,null,null,null,null,null,null,null,null,null,null,null,null,null,null,null,null,null,""]
[39,"Are you planning on using a dedicated die cast machine? If not, what are your plans?",null,null,null,null,null,null,null,null,null,null,null,null,null,null,null,null,null,null,null,null,null,null,null,null,""]
[40,"In the trimming operation is there a sensor to determine if the part(s) is located properly?",null,null,null,null,null,null,null,null,null,null,null,null,null,null,null,null,null,null,null,null,null,null,null,null,""]
["40a","How is scrap removed from the trim tool and how is it verified to assure proper operation?",null,null,null,null,null,null,null,null,null,null,null,null,null,null,null,null,null,null,null,null,null,null,null,null,""]
[41,"Are you planning on utilizing a die penetrant with black light inspectiion for cracked parts during the launch phase?",null,null,null,null,null,null,null,null,null,null,null,null,null,null,null,null,null,null,null,null,null,null,null,null,""]
[42,"Does visual control operation have special requirements for operators rotation and/or breaks/maximum amount of time which 1 operator can work on station to prevent fatigue and loss of focus?",null,null,null,null,null,null,null,null,null,null,null,null,null,null,null,null,null,null,null,null,null,null,null,null,""]

{"sheet":"Diecast Zinc","index":20,"n_rows":27,"n_cols":27,"rows_kept":27,"cut":false,"hidden":true,"merged":[[10,3,10,5],[11,3,11,5],[12,3,12,5],[13,3,13,5],[2,3,2,5],[3,3,3,5],[4,3,4,5],[5,3,5,5],[6,3,6,5],[7,3,7,5],[26,3,26,5],[0,2,0,8],[20,3,20,5],[21,3,21,5],[22,3,22,5],[23,3,23,5],[24,3,24,5],[25,3,25,5],[14,3,14,5],[15,3,15,5],[16,3,16,5],[17,3,17,5],[18,3,18,5],[19,3,19,5],[8,3,8,5],[9,3,9,5]]}
[null,null,"Diecast Zinc Technical Supplement",null,null,null,null,null,null,null,null,null,null,null,null,null,null,null,null,null,null,null,null,null,null,null,{"$f":"'1-Program Info'!L41","v":"No"}]
[null,null," "]
["Item #","Nexteer Requirement","Supplier Response","Supplier Comments",null,null,"Mitigation Plan","Mitigation Plan Owner","Status\n(Nexteer AQE/SQE)"]
[1,"What alloys do you typically cast? Do you have experience with Accuzinc?",null,null,null,null,null,null,null,null,null,null,null,null,null,null,null,null,null,null,null,null,null,null,null,null,{"$f":"IF($AA$1=\"Yes\",IF(OR(ISBLANK(I4),I4=\"Open\"),\"R\",IF(I4=\"Mitigation Plan Approved\",\"Y\",\"G\")),\"\")","v":""}]
[2,"How is the charge material, re-melt and different alloys segregated?",null,null,null,null,null,null,null,null,null,null,null,null,null,null,null,null,null,null,null,null,null,null,null,null,{"$f":"IF($AA$1=\"Yes\",IF(OR(ISBLANK(I5),I5=\"Open\"),\"R\",IF(I5=\"Mitigation Plan Approved\",\"Y\",\"G\")),\"\")","v":""}]
[3,"How is incoming material checked? Is it certified?",null,null,null,null,null,null,null,null,null,null,null,null,null,null,null,null,null,null,null,null,null,null,null,null,""]
[4,"What type of melting furnace / process is used?",null,null,null,null,null,null,null,null,null,null,null,null,null,null,null,null,null,null,null,null,null,null,null,null,""]
[5,"How is metal transferred to holding furnace at the diecast machines (ladle, launder, etc.)?",null,null,null,null,null,null,null,null,null,null,null,null,null,null,null,null,null,null,null,null,null,null,null,null,""]
[6,"How is chemistry checked at melting furnace and diecast machines? What frequency and is it SPC charted?",null,null,null,null,null,null,null,null,null,null,null,null,null,null,null,null,null,null,null,null,null,null,null,null,""]
[7,"How are mechanical properties checked? Are test bars cast or machined? Is data stored and readily available?",null,null,null,null,null,null,null,null,null,null,null,null,null,null,null,null,null,null,null,null,null,null,null,null,""]
[8,"How are casting lots defined (hours, pieces, shift)?",null,null,null,null,null,null,null,null,null,null,null,null,null,null,null,null,null,null,null,null,null,null,null,null,""]
[9,"What tonnage diecast machine will be used? What type horizontal or vertical / cold or hot chamber? Is it fully automated such as die lube and casting extraction and trim? If not automated is die lube manual, fixed manifold or flexible nozzles? ",null,null,null,null,null,null,null,null,null,null,null,null,null,null,null,null,null,null,null,null,null,null,null,null,""]
[10,"What is done to prevent damage from ejection?",null,null,null,null,null,null,null,null,null,null,null,null,null,null,null,null,null,null,null,null,null,null,null,null,""]
[11,"How is metal transferred to diecast machine shot sleeve (ladle, pump, etc.)? What is done to minimize inclusions?",null,null,null,null,null,null,null,null,null,null,null,null,null,null,null,null,null,null,null,null,null,null,null,null,""]
[12,"What is the max. shot intensification pressure and cavity pressure?",null,null,null,null,null,null,null,null,null,null,null,null,null,null,null,null,null,null,null,null,null,null,null,null,""]
[13,"How is the biscuit length controlled?",null,null,null,null,null,null,null,null,null,null,null,null,null,null,null,null,null,null,null,null,null,null,null,null,""]
[14,"Are dies designed and built in house or outside?",null,null,null,null,null,null,null,null,null,null,null,null,null,null,null,null,null,null,null,null,null,null,null,null,""]
[15,"Do you have tooling layout, casting layout and inspection capability using math data and 2D drawings? What type of CMM is used?",null,null,null,null,null,null,null,null,null,null,null,null,null,null,null,null,null,null,null,null,null,null,null,null,""]
[16,"What die cavity material is used?",null,null,null,null,null,null,null,null,null,null,null,null,null,null,null,null,null,null,null,null,null,null,null,null,""]
[17,"How many cavities are planned and number of slides and core pulls?",null,null,null,null,null,null,null,null,null,null,null,null,null,null,null,null,null,null,null,null,null,null,null,null,""]
[18,"What casting identification will be on the part (cavity number, shift, date etc.)?",null,null,null,null,null,null,null,null,null,null,null,null,null,null,null,null,null,null,null,null,null,null,null,null,""]
[19,"Do you have core interlock capability? Do you have cast insert capability?",null,null,null,null,null,null,null,null,null,null,null,null,null,null,null,null,null,null,null,null,null,null,null,null,""]
[20,"Do you have die fill simulation capability in house or outside? Will it be applied to this part?",null,null,null,null,null,null,null,null,null,null,null,null,null,null,null,null,null,null,null,null,null,null,null,null,""]
[21,"Are gate and vent locations defined?",null,null,null,null,null,null,null,null,null,null,null,null,null,null,null,null,null,null,null,null,null,null,null,null,""]
[22,"What type of die cooling system is used (water, oil or combined)? If water is used is it treated? What type of die temperature methods / controls are used? Are flow meters used?",null,null,null,null,null,null,null,null,null,null,null,null,null,null,null,null,null,null,null,null,null,null,null,null,""]
[23,"How is tooling controlled? What are the typical number of shots for inspection, re-furbish and new? How was replacement dies quoted?",null,null,null,null,null,null,null,null,null,null,null,null,null,null,null,null,null,null,null,null,null,null,null,null,""]
[24,"Do you have x-ray capability in house or outside? Is it certified? Is it film, digital or real time?",null,null,null,null,null,null,null,null,null,null,null,null,null,null,null,null,null,null,null,null,null,null,null,null,""]

{"sheet":"Ductile Iron","index":21,"n_rows":28,"n_cols":27,"rows_kept":28,"cut":false,"hidden":true,"merged":[[7,3,7,5],[2,3,2,5],[3,3,3,5],[4,3,4,5],[5,3,5,5],[6,3,6,5],[9,3,9,5],[10,3,10,5],[11,3,11,5],[12,3,12,5],[13,3,13,5],[26,3,26,5],[27,3,27,5],[0,2,0,8],[20,3,20,5],[21,3,21,5],[22,3,22,5],[23,3,23,5],[24,3,24,5],[25,3,25,5],[14,3,14,5],[15,3,15,5],[16,3,16,5],[17,3,17,5],[18,3,18,5],[19,3,19,5],[8,3,8,5]]}
[null,null,"Ductile Iron Technical Supplement",null,null,null,null,null,null,null,null,null,null,null,null,null,null,null,null,null,null,null,null,null,null,null,{"$f":"'1-Program Info'!L14","v":"No"}]
[null,null," "]
["Item #","Nexteer Requirement","Supplier Response","Supplier Comments",null,null,"Mitigation Plan","Mitigation Plan Owner","Status\n(Nexteer AQE/SQE)"]
[1,"What type of charge material is used? What type of checks are made? Is the material certified? How is it segregated? Is de-sulfurization required after melting?",null,null,null,null,null,null,null,null,null,null,null,null,null,null,null,null,null,null,null,null,null,null,null,null,{"$f":"IF($AA$1=\"Yes\",IF(OR(ISBLANK(I4),I4=\"Open\"),\"R\",IF(I4=\"Mitigation Plan Approved\",\"Y\",\"G\")),\"\")","v":""}]
[2,"What type of melting unit and system is used?",null,null,null,null,null,null,null,null,null,null,null,null,null,null,null,null,null,null,null,null,null,null,null,null,{"$f":"IF($AA$1=\"Yes\",IF(OR(ISBLANK(I5),I5=\"Open\"),\"R\",IF(I5=\"Mitigation Plan Approved\",\"Y\",\"G\")),\"\")","v":""}]
[3,"What method is used for magnesium inoculation (sandwich, tundish ladle, Fischer process etc.)? Do you monitor Mg residual?",null,null,null,null,null,null,null,null,null,null,null,null,null,null,null,null,null,null,null,null,null,null,null,null,""]
[4,"What control / system is used for fade prevention (such as timer, nodularity coupon etc.)? What is your control limit for % nodularity? What traceability system and documentation is used? How is rejected material controlled and disposed of?",null,null,null,null,null,null,null,null,null,null,null,null,null,null,null,null,null,null,null,null,null,null,null,null,""]
[5,"What type of pouring system is used? What method is used for post inoculant (Fe, Si). What is used to control head height? How is pour temperature controlled?",null,null,null,null,null,null,null,null,null,null,null,null,null,null,null,null,null,null,null,null,null,null,null,null,""]
[6,"How is chemistry controlled at melt, holding and pour furnace? Are SPC charts used? Is data readily available? What  is used for traceability?",null,null,null,null,null,null,null,null,null,null,null,null,null,null,null,null,null,null,null,null,null,null,null,null,""]
[7,"How is microstructure checked and where in the process?",null,null,null,null,null,null,null,null,null,null,null,null,null,null,null,null,null,null,null,null,null,null,null,null,""]
[8,"What tests are performed and how for mechanical properties? Are test bars cast or machined?",null,null,null,null,null,null,null,null,null,null,null,null,null,null,null,null,null,null,null,null,null,null,null,null,""]
[9,"How are lots defined?",null,null,null,null,null,null,null,null,null,null,null,null,null,null,null,null,null,null,null,null,null,null,null,null,""]
[10,"What type of molding process is used (greensand or shell)?",null,null,null,null,null,null,null,null,null,null,null,null,null,null,null,null,null,null,null,null,null,null,null,null,""]
[11,"What type of molding equipment is used (Disa, SPO, Osborne etc.)? ",null,null,null,null,null,null,null,null,null,null,null,null,null,null,null,null,null,null,null,null,null,null,null,null,""]
[12,"How is sand monitored and controlled? Are sand checks documented and available for problem solving?",null,null,null,null,null,null,null,null,null,null,null,null,null,null,null,null,null,null,null,null,null,null,null,null,""]
[13,"Do you have coremaking and core setting capability? What type of coremaking (coldbox, hotbox etc.)?",null,null,null,null,null,null,null,null,null,null,null,null,null,null,null,null,null,null,null,null,null,null,null,null,""]
[14,"Is a core required or planned for this part? If yes are the coreprints designed to maintain dimensional control?",null,null,null,null,null,null,null,null,null,null,null,null,null,null,null,null,null,null,null,null,null,null,null,null,""]
[15,"Is tooling designed and built in house or outside? What material is used for the patterns? How many cycles are planned for maintenance, re-furb and new?",null,null,null,null,null,null,null,null,null,null,null,null,null,null,null,null,null,null,null,null,null,null,null,null,""]
[16,"Do you have tooling layout, casting layout and inspection capability using math data and 2D drawings? What type of CMM is used?",null,null,null,null,null,null,null,null,null,null,null,null,null,null,null,null,null,null,null,null,null,null,null,null,""]
[17,"How many cavities are planned for this part (both pattern and corebox if required)?",null,null,null,null,null,null,null,null,null,null,null,null,null,null,null,null,null,null,null,null,null,null,null,null,""]
[18,"What casting identification will be on the part (pattern number, core number, shift, date etc.)?",null,null,null,null,null,null,null,null,null,null,null,null,null,null,null,null,null,null,null,null,null,null,null,null,""]
[19,"Do you have mold fill and solidification simulation capability. Was it applied to this part?",null,null,null,null,null,null,null,null,null,null,null,null,null,null,null,null,null,null,null,null,null,null,null,null,""]
[20,"Has the gating system been defined along with gate locations? Are filters used?",null,null,null,null,null,null,null,null,null,null,null,null,null,null,null,null,null,null,null,null,null,null,null,null,""]
[21,"What method / system is used for gate and fin removal?",null,null,null,null,null,null,null,null,null,null,null,null,null,null,null,null,null,null,null,null,null,null,null,null,""]
[22,"Do you have x-ray capability in-house or outside? What type film, digital or realtime?",null,null,null,null,null,null,null,null,null,null,null,null,null,null,null,null,null,null,null,null,null,null,null,null,""]
[23,"Do you have heat treat capability?",null,null,null,null,null,null,null,null,null,null,null,null,null,null,null,null,null,null,null,null,null,null,null,null,""]
[24,"If heat treat is required what process is used and how is it controlled and monitored? How are lots defined?",null,null,null,null,null,null,null,null,null,null,null,null,null,null,null,null,null,null,null,null,null,null,null,null,""]
[25,"How often and where are BHN checks made?",null,null,null,null,null,null,null,null,null,null,null,null,null,null,null,null,null,null,null,null,null,null,null,null,""]

{"sheet":"Electrical","index":22,"n_rows":14,"n_cols":27,"rows_kept":14,"cut":false,"hidden":true,"merged":[[12,3,12,5],[13,3,13,5],[2,3,2,5],[3,3,3,5],[4,3,4,5],[5,3,5,5],[6,3,6,5],[7,3,7,5],[0,2,0,8],[8,3,8,5],[9,3,9,5],[10,3,10,5],[11,3,11,5]]}
[null,null,"Electrical Technical Supplement",null,null,null,null,null,null,null,null,null,null,null,null,null,null,null,null,null,null,null,null,null,null,null,{"$f":"'1-Program Info'!L15","v":"No"}]
[]
["Item #","Nexteer Requirement","Supplier Response","Supplier Comments",null,null,"Mitigation Plan","Mitigation Plan Owner","Status\n(Nexteer AQE/SQE)"]
[1,"Is the environment appropriate in keeping the machine accuracy(vibration, heat, dust, etc.)?",null,null,null,null,null,null,null,null,null,null,null,null,null,null,null,null,null,null,null,null,null,null,null,null,{"$f":"IF($AA$1=\"Yes\",IF(OR(ISBLANK(I4),I4=\"Open\"),\"R\",IF(I4=\"Mitigation Plan Approved\",\"Y\",\"G\")),\"\")","v":""}]
[2,"Will the product get damaged when put in the shooter?",null,null,null,null,null,null,null,null,null,null,null,null,null,null,null,null,null,null,null,null,null,null,null,null,{"$f":"IF($AA$1=\"Yes\",IF(OR(ISBLANK(I5),I5=\"Open\"),\"R\",IF(I5=\"Mitigation Plan Approved\",\"Y\",\"G\")),\"\")","v":""}]
[3,"Is tooling controlled by the person in charge of the line or centrally controlled?",null,null,null,null,null,null,null,null,null,null,null,null,null,null,null,null,null,null,null,null,null,null,null,null,""]
[4,"Contamination:",null,null,null,null,null,null,null,null,null,null,null,null,null,null,null,null,null,null,null,null,null,null,null,null,""]
[5,"* What is the required level of cleanliness?",null,null,null,null,null,null,null,null,null,null,null,null,null,null,null,null,null,null,null,null,null,null,null,null,""]
[6,"* How do you plan to avoid contamination?",null,null,null,null,null,null,null,null,null,null,null,null,null,null,null,null,null,null,null,null,null,null,null,null,""]
[7,"* What are the possible sources of contamination?",null,null,null,null,null,null,null,null,null,null,null,null,null,null,null,null,null,null,null,null,null,null,null,null,""]
[8,"Are there any noise issues?",null,null,null,null,null,null,null,null,null,null,null,null,null,null,null,null,null,null,null,null,null,null,null,null,""]
[9,"Are there any test connectors?",null,null,null,null,null,null,null,null,null,null,null,null,null,null,null,null,null,null,null,null,null,null,null,null,""]
[10,"Will there be repairs?",null,null,null,null,null,null,null,null,null,null,null,null,null,null,null,null,null,null,null,null,null,null,null,null,""]
[11,"How will sharp edges be addressed?  If parts will be deburred is bending a potential?",null,null,null,null,null,null,null,null,null,null,null,null,null,null,null,null,null,null,null,null,null,null,null,null,""]

{"sheet":"Fastener","index":23,"n_rows":14,"n_cols":27,"rows_kept":14,"cut":false,"hidden":true,"merged":[[8,3,8,5],[9,3,9,5],[10,3,10,5],[13,3,13,5],[0,2,0,8],[2,3,2,5],[3,3,3,5],[4,3,4,5],[5,3,5,5],[6,3,6,5],[7,3,7,5],[11,3,11,5],[12,3,12,5]]}
[null,null,"Fastener Technical Supplement",null,null,null,null,null,null,null,null,null,null,null,null,null,null,null,null,null,null,null,null,null,null,null,{"$f":"'1-Program Info'!L18","v":"No"}]
[]
["Item #","Nexteer Requirement","Supplier Response","Supplier Comments",null,null,"Mitigation Plan","Mitigation Plan Owner","Status\n(Nexteer AQE/SQE)"]
[1,"Is the heading process of the material fully understood and controlled?",null,null,null,null,null,null,null,null,null,null,null,null,null,null,null,null,null,null,null,null,null,null,null,null,{"$f":"IF($AA$1=\"Yes\",IF(OR(ISBLANK(I4),I4=\"Open\"),\"R\",IF(I4=\"Mitigation Plan Approved\",\"Y\",\"G\")),\"\")","v":""}]
[2,"How do you keep track of the quality of the first trial product?",null,null,null,null,null,null,null,null,null,null,null,null,null,null,null,null,null,null,null,null,null,null,null,null,{"$f":"IF($AA$1=\"Yes\",IF(OR(ISBLANK(I5),I5=\"Open\"),\"R\",IF(I5=\"Mitigation Plan Approved\",\"Y\",\"G\")),\"\")","v":""}]
[3,"How and what do you inspect for incoming materials?",null,null,null,null,null,null,null,null,null,null,null,null,null,null,null,null,null,null,null,null,null,null,null,null,""]
[4,"Is the environment appropriate in keeping the machine accuracy (lighting, vibration, heat, dust, etc.)?",null,null,null,null,null,null,null,null,null,null,null,null,null,null,null,null,null,null,null,null,null,null,null,null,""]
[5,"How is tooling controlled and verified?",null,null,null,null,null,null,null,null,null,null,null,null,null,null,null,null,null,null,null,null,null,null,null,null,""]
[6,"Are there any built-in systems that can detect cracks or defects in the punch or tooling?",null,null,null,null,null,null,null,null,null,null,null,null,null,null,null,null,null,null,null,null,null,null,null,null,""]
[7,"How do you verify that the Process systems are working properly? Who does the system inspection, and how often?",null,null,null,null,null,null,null,null,null,null,null,null,null,null,null,null,null,null,null,null,null,null,null,null,""]
[8,"How do you verify that the Detection systems are workign properly? Who does the system inspection, and how often?",null,null,null,null,null,null,null,null,null,null,null,null,null,null,null,null,null,null,null,null,null,null,null,null,""]
[9,"Do you sort the final product for mixed parts and other defects?",null,null,null,null,null,null,null,null,null,null,null,null,null,null,null,null,null,null,null,null,null,null,null,null,""]
[10,"Are CL's identified and G1331 procedures followed?",null,null,null,null,null,null,null,null,null,null,null,null,null,null,null,null,null,null,null,null,null,null,null,null,""]
[11,"How is the tooling maintaned?",null,null,null,null,null,null,null,null,null,null,null,null,null,null,null,null,null,null,null,null,null,null,null,null,""]

{"sheet":"Springs","index":24,"n_rows":14,"n_cols":27,"rows_kept":14,"cut":false,"hidden":true,"merged":[[13,3,13,5],[7,3,7,5],[8,3,8,5],[9,3,9,5],[10,3,10,5],[11,3,11,5],[12,3,12,5],[6,3,6,5],[0,2,0,8],[2,3,2,5],[3,3,3,5],[4,3,4,5],[5,3,5,5]]}
[null,null,"Fastener Technical Supplement",null,null,null,null,null,null,null,null,null,null,null,null,null,null,null,null,null,null,null,null,null,null,null,{"$f":"'1-Program Info'!L32","v":"No"}]
[]
["Item #","Nexteer Requirement","Supplier Response","Supplier Comments",null,null,"Mitigation Plan","Mitigation Plan Owner","Status\n(Nexteer AQE/SQE)"]
[1,"Is the cutting process of the material fully understood and controlled? How is the cutter maintained?",null,null,null,null,null,null,null,null,null,null,null,null,null,null,null,null,null,null,null,null,null,null,null,null,{"$f":"IF($AA$1=\"Yes\",IF(OR(ISBLANK(I4),I4=\"Open\"),\"R\",IF(I4=\"Mitigation Plan Approved\",\"Y\",\"G\")),\"\")","v":""}]
[2,"How do you keep track of the quality of the first trial product?",null,null,null,null,null,null,null,null,null,null,null,null,null,null,null,null,null,null,null,null,null,null,null,null,{"$f":"IF($AA$1=\"Yes\",IF(OR(ISBLANK(I5),I5=\"Open\"),\"R\",IF(I5=\"Mitigation Plan Approved\",\"Y\",\"G\")),\"\")","v":""}]
[3,"How and what do you inspect for incoming materials?",null,null,null,null,null,null,null,null,null,null,null,null,null,null,null,null,null,null,null,null,null,null,null,null,""]
[4,"Is the environment appropriate in keeping the machine accuracy (lighting, vibration, heat, dust, etc.)?",null,null,null,null,null,null,null,null,null,null,null,null,null,null,null,null,null,null,null,null,null,null,null,null,""]
[5,"How is tooling controlled and verified?",null,null,null,null,null,null,null,null,null,null,null,null,null,null,null,null,null,null,null,null,null,null,null,null,""]
[6,"Are there any built-in systems that can detect cracks or defects in the punch or tooling?",null,null,null,null,null,null,null,null,null,null,null,null,null,null,null,null,null,null,null,null,null,null,null,null,""]
[7,"How do you verify that the Process systems are working properly? Who does the system inspection, and how often?",null,null,null,null,null,null,null,null,null,null,null,null,null,null,null,null,null,null,null,null,null,null,null,null,""]
[8,"How do you verify that the Detection systems are workign properly? Who does the system inspection, and how often?",null,null,null,null,null,null,null,null,null,null,null,null,null,null,null,null,null,null,null,null,null,null,null,null,""]
[9,"Do you sort the final product for mixed parts and other defects?",null,null,null,null,null,null,null,null,null,null,null,null,null,null,null,null,null,null,null,null,null,null,null,null,""]
[10,"Are CL's identified and G1331 procedures followed?",null,null,null,null,null,null,null,null,null,null,null,null,null,null,null,null,null,null,null,null,null,null,null,null,""]
[11,"How is the tooling maintaned?",null,null,null,null,null,null,null,null,null,null,null,null,null,null,null,null,null,null,null,null,null,null,null,null,""]

{"sheet":"Forging","index":25,"n_rows":55,"n_cols":27,"rows_kept":55,"cut":false,"hidden":true,"merged":[[7,3,7,5],[2,3,2,5],[3,3,3,5],[4,3,4,5],[5,3,5,5],[6,3,6,5],[19,3,19,5],[8,3,8,5],[9,3,9,5],[10,3,10,5],[11,3,11,5],[12,3,12,5],[13,3,13,5],[14,3,14,5],[15,3,15,5],[16,3,16,5],[17,3,17,5],[18,3,18,5],[31,3,31,5],[20,3,20,5],[21,3,21,5],[22,3,22,5],[23,3,23,5],[24,3,24,5],[25,3,25,5],[48,3,48,5],[49,3,49,5],[38,3,38,5],[39,3,39,5],[40,3,40,5],[41,3,41,5],[42,3,42,5],[43,3,43,5],[0,2,0,8],[44,3,44,5],[45,3,45,5],[46,3,46,5],[47,3,47,5],[32,3,32,5],[33,3,33,5],[34,3,34,5],[35,3,35,5],[36,3,36,5],[37,3,37,5],[26,3,26,5],[27,3,27,5],[28,3,28,5],[29,3,29,5],[30,3,30,5],[50,3,50,5],[51,3,51,5],[52,3,52,5],[53,3,53,5],[54,3,54,5]]}
[null,null,"Forging Technical Supplement",null,null,null,null,null,null,null,null,null,null,null,null,null,null,null,null,null,null,null,null,null,null,null,{"$f":"'1-Program Info'!L19","v":"No"}]
[]
["Item #","Nexteer Requirement","Supplier Response","Supplier Comments",null,null,"Mitigation Plan","Mitigation Plan Owner","Status\n(Nexteer AQE/SQE)"]
[1,"Do you have chemical analysis capabliity?",null,null,null,null,null,null,null,null,null,null,null,null,null,null,null,null,null,null,null,null,null,null,null,null,{"$f":"IF($AA$1=\"Yes\",IF(OR(ISBLANK(I4),I4=\"Open\"),\"R\",IF(I4=\"Mitigation Plan Approved\",\"Y\",\"G\")),\"\")","v":""}]
[2,"Do you have hardness testing capability?",null,null,null,null,null,null,null,null,null,null,null,null,null,null,null,null,null,null,null,null,null,null,null,null,{"$f":"IF($AA$1=\"Yes\",IF(OR(ISBLANK(I5),I5=\"Open\"),\"R\",IF(I5=\"Mitigation Plan Approved\",\"Y\",\"G\")),\"\")","v":""}]
[3,"Do you have any mechanical testing capability?",null,null,null,null,null,null,null,null,null,null,null,null,null,null,null,null,null,null,null,null,null,null,null,null,""]
[4,"Do you have a documented process for maintaining the identity of the heat code throughout the process? Do you comply with the process?",null,null,null,null,null,null,null,null,null,null,null,null,null,null,null,null,null,null,null,null,null,null,null,null,""]
[5,"Do you document and provide the receiving facility with the Mill cert and heat code associated with the forged parts being manufactured? Do you comply with this process?",null,null,null,null,null,null,null,null,null,null,null,null,null,null,null,null,null,null,null,null,null,null,null,null,""]
[6,"Do you have a documented process for material storage using the FIFO methodology? Do you comply wih this process?",null,null,null,null,null,null,null,null,null,null,null,null,null,null,null,null,null,null,null,null,null,null,null,null,""]
[7,"Do you have documented Packaging specifications for each Nexteer Automotive Part? Do you comply with this process?",null,null,null,null,null,null,null,null,null,null,null,null,null,null,null,null,null,null,null,null,null,null,null,null,""]
[8,"Do you have a documented process to review the cut or sheared faces at set-up for defects? Do you comply with this process?",null,null,null,null,null,null,null,null,null,null,null,null,null,null,null,null,null,null,null,null,null,null,null,null,""]
[9,"Do you have documented process limits for cold shearing based on steel grade and bar diameter? Do you comply with this process?",null,null,null,null,null,null,null,null,null,null,null,null,null,null,null,null,null,null,null,null,null,null,null,null,""]
[10,"Do you have a documented process to inspect billets for squareness? Do you comply with this process?",null,null,null,null,null,null,null,null,null,null,null,null,null,null,null,null,null,null,null,null,null,null,null,null,""]
[11,"Do you have a predictive/prevantative maintenance process for shear tooling? Do you comply with this process?",null,null,null,null,null,null,null,null,null,null,null,null,null,null,null,null,null,null,null,null,null,null,null,null,""]
[12,"Do you have a documented process for control of the mult/billet size? Do you comply with this process?",null,null,null,null,null,null,null,null,null,null,null,null,null,null,null,null,null,null,null,null,null,null,null,null,""]
[13,"How often do you weigh the mults? ",null,null,null,null,null,null,null,null,null,null,null,null,null,null,null,null,null,null,null,null,null,null,null,null,""]
[14,"Document your heating process and equipment",null,null,null,null,null,null,null,null,null,null,null,null,null,null,null,null,null,null,null,null,null,null,null,null,""]
[15,"Do you have a documented process to handle Variations in the Heating process associated with Breaks, machine downtime, shift change, etc? Do you comply with this process? ",null,null,null,null,null,null,null,null,null,null,null,null,null,null,null,null,null,null,null,null,null,null,null,null,""]
[16,"Do you have infrared temperature monitoring?",null,null,null,null,null,null,null,null,null,null,null,null,null,null,null,null,null,null,null,null,null,null,null,null,""]
[17,"If Pyrometer is utilized in the system is it multi wave length?",null,null,null,null,null,null,null,null,null,null,null,null,null,null,null,null,null,null,null,null,null,null,null,null,""]
[18,"If Single frequency, how is emissitivity set?",null,null,null,null,null,null,null,null,null,null,null,null,null,null,null,null,null,null,null,null,null,null,null,null,""]
[19,"Do you have a documented process to measure the temperature of each mult prior to forging? Do you comply with this process?",null,null,null,null,null,null,null,null,null,null,null,null,null,null,null,null,null,null,null,null,null,null,null,null,""]
[20,"If Induction heating is being utilized do you have a documented process for power monitoring and process feedback? Do you comply with this process?",null,null,null,null,null,null,null,null,null,null,null,null,null,null,null,null,null,null,null,null,null,null,null,null,""]
[21,"Do you have a documented process to Calibrate the Temperature/ Power Monitoring Equipment? Do you comply with this process?",null,null,null,null,null,null,null,null,null,null,null,null,null,null,null,null,null,null,null,null,null,null,null,null,""]
[22,"Do you have a documented process for calibration of all gages on instrument panels?  Do you comply with this process?",null,null,null,null,null,null,null,null,null,null,null,null,null,null,null,null,null,null,null,null,null,null,null,null,""]
[23,"Do you have a documented process to reject Mults outside the established range for temperature and/or time? Do you comply with this process?",null,null,null,null,null,null,null,null,null,null,null,null,null,null,null,null,null,null,null,null,null,null,null,null,""]
[24,"Are all heat treat (Both captive & Outsourced Sources) qualified per ES-HT-FW0025?",null,null,null,null,null,null,null,null,null,null,null,null,null,null,null,null,null,null,null,null,null,null,null,null,""]
[25,"Are all heat treat (Both captive & Outsourced Sources) qualified per CQI -9 Requirements?",null,null,null,null,null,null,null,null,null,null,null,null,null,null,null,null,null,null,null,null,null,null,null,null,""]
[26,"Do you have a documented Process/Procedure for the pre-heating of dies? Do you comply with this process?",null,null,null,null,null,null,null,null,null,null,null,null,null,null,null,null,null,null,null,null,null,null,null,null,""]
[27,"Do you have a documented process for Die Storage (a place for everything and everything in its place)? Do you comply with this process?",null,null,null,null,null,null,null,null,null,null,null,null,null,null,null,null,null,null,null,null,null,null,null,null,""]
[28,"Do you have a predictive/preventative maintenance process for Dies?  Do you comply with this process?",null,null,null,null,null,null,null,null,null,null,null,null,null,null,null,null,null,null,null,null,null,null,null,null,""]
[29,"Do you have a documented process for die review after the completion of production run? Do you comply with this process?",null,null,null,null,null,null,null,null,null,null,null,null,null,null,null,null,null,null,null,null,null,null,null,null,""]
[30,"Do you have a documented process for Press Set Up? Do you comply with this process? ",null,null,null,null,null,null,null,null,null,null,null,null,null,null,null,null,null,null,null,null,null,null,null,null,""]
[31,"Do you have a documented process for review of the Press Tonnage during the set-up process? Do you comply with this process?",null,null,null,null,null,null,null,null,null,null,null,null,null,null,null,null,null,null,null,null,null,null,null,null,""]
[32,"Do you have a documented process for the calibration of the load cells? Do you comply with this process?",null,null,null,null,null,null,null,null,null,null,null,null,null,null,null,null,null,null,null,null,null,null,null,null,""]
[33,"Are the set up checks based on air or water cooling of parts? \n(If water cooled how do you validate that no additional hardening is occurring)",null,null,null,null,null,null,null,null,null,null,null,null,null,null,null,null,null,null,null,null,null,null,null,null,""]
[34,"Do you have a documented process for Die Change over? Do you comply with this process?",null,null,null,null,null,null,null,null,null,null,null,null,null,null,null,null,null,null,null,null,null,null,null,null,""]
[35,"What is the average time for Die Change over?  \n(Information Only)",null,null,null,null,null,null,null,null,null,null,null,null,null,null,null,null,null,null,null,null,null,null,null,null,""]
[36,"Do you have a documented process for prevention and detection of Cracks? Do you comply with this process?",null,null,null,null,null,null,null,null,null,null,null,null,null,null,null,null,null,null,null,null,null,null,null,null,""]
[37,"Do you have a documented process for prevention and detection of Laps? Do you comply with this process?",null,null,null,null,null,null,null,null,null,null,null,null,null,null,null,null,null,null,null,null,null,null,null,null,""]
[38,"Do you have a documented process for preventing and detecting Embedded Scale or Excess Scale? Do you comply with this process?",null,null,null,null,null,null,null,null,null,null,null,null,null,null,null,null,null,null,null,null,null,null,null,null,""]
[39,"Do you have a documented process for managing Legibility? Do you comply with this process?",null,null,null,null,null,null,null,null,null,null,null,null,null,null,null,null,null,null,null,null,null,null,null,null,""]
[40,"Do you have a documented process for preventing and detecting Improper Grain Flow? Do you comply with this process?",null,null,null,null,null,null,null,null,null,null,null,null,null,null,null,null,null,null,null,null,null,null,null,null,""]
[41,"Do you have a documented process for controlling forging temperature and time at heat? Do you comply with this process?",null,null,null,null,null,null,null,null,null,null,null,null,null,null,null,null,null,null,null,null,null,null,null,null,""]
[42,"Do you have a documented process for cleaning scale from forged parts? Do you comply with this process?",null,null,null,null,null,null,null,null,null,null,null,null,null,null,null,null,null,null,null,null,null,null,null,null,""]
[43,"Do you have a documented process for maintaining the cleaning abrasive and shot blast equipment? Do you comply with this process?",null,null,null,null,null,null,null,null,null,null,null,null,null,null,null,null,null,null,null,null,null,null,null,null,""]
[44,"Do you have a documented process for the method of validating hardenability? Do you comply with this process?",null,null,null,null,null,null,null,null,null,null,null,null,null,null,null,null,null,null,null,null,null,null,null,null,""]
[45,"Do you have a documented process for Heat Code Assignment? Do you comply with this process? (Minimum of an annual review)",null,null,null,null,null,null,null,null,null,null,null,null,null,null,null,null,null,null,null,null,null,null,null,null,""]
[46,"Do you have a documented process for review of the Micro structure of the forged parts being produced? Do you comply with this process?",null,null,null,null,null,null,null,null,null,null,null,null,null,null,null,null,null,null,null,null,null,null,null,null,""]
[47,"Do you have a documented process for cooling the product? Do you comply with this process?",null,null,null,null,null,null,null,null,null,null,null,null,null,null,null,null,null,null,null,null,null,null,null,null,""]
[48,"Do all coatings that the supplier utilizes meet the Nexteer Automotive Specifications and Requirements?",null,null,null,null,null,null,null,null,null,null,null,null,null,null,null,null,null,null,null,null,null,null,null,null,""]
[49,"Do you have a documented process for part dimensional inspection? Do you comply with this process?",null,null,null,null,null,null,null,null,null,null,null,null,null,null,null,null,null,null,null,null,null,null,null,null,""]
[50,"Do you have a documented process to Calibrate the Dimensional Inspection Equipment? Do you comply with this process?",null,null,null,null,null,null,null,null,null,null,null,null,null,null,null,null,null,null,null,null,null,null,null,null,""]
[51,"Do you Have a Documented Process for Re-work/Salvage? Do you comply with this process?",null,null,null,null,null,null,null,null,null,null,null,null,null,null,null,null,null,null,null,null,null,null,null,null,""]
[52,"If this part is subject to magnetic particle inspection requirements do they meet or exceed the requirements per the ASTM?",null,null,null,null,null,null,null,null,null,null,null,null,null,null,null,null,null,null,null,null,null,null,null,null,""]

{"sheet":"Grey Iron","index":26,"n_rows":26,"n_cols":27,"rows_kept":26,"cut":false,"hidden":true,"merged":[[7,3,7,5],[24,3,24,5],[25,3,25,5],[14,3,14,5],[15,3,15,5],[16,3,16,5],[17,3,17,5],[18,3,18,5],[19,3,19,5],[0,2,0,8],[20,3,20,5],[21,3,21,5],[22,3,22,5],[23,3,23,5],[8,3,8,5],[9,3,9,5],[10,3,10,5],[11,3,11,5],[12,3,12,5],[13,3,13,5],[2,3,2,5],[3,3,3,5],[4,3,4,5],[5,3,5,5],[6,3,6,5]]}
[null,null,"Grey Iron Technical Supplement",null,null,null,null,null,null,null,null,null,null,null,null,null,null,null,null,null,null,null,null,null,null,null,{"$f":"'1-Program Info'!L20","v":"No"}]
[null,null," "]
["Item #","Nexteer Requirement","Supplier Response","Supplier Comments",null,null,"Mitigation Plan","Mitigation Plan Owner","Status\n(Nexteer AQE/SQE)"]
[1,"What type of charge material is used? What type of checks are made? Is the material certified? How is it segregated? ",null,null,null,null,null,null,null,null,null,null,null,null,null,null,null,null,null,null,null,null,null,null,null,null,{"$f":"IF($AA$1=\"Yes\",IF(OR(ISBLANK(I4),I4=\"Open\"),\"R\",IF(I4=\"Mitigation Plan Approved\",\"Y\",\"G\")),\"\")","v":""}]
[2,"What type of melting unit and system is used?",null,null,null,null,null,null,null,null,null,null,null,null,null,null,null,null,null,null,null,null,null,null,null,null,{"$f":"IF($AA$1=\"Yes\",IF(OR(ISBLANK(I5),I5=\"Open\"),\"R\",IF(I5=\"Mitigation Plan Approved\",\"Y\",\"G\")),\"\")","v":""}]
[3,"What type of pouring system is used? What method is used for post inoculant (Fe, Si). What is used to control head height? How is pour temperature contolled?",null,null,null,null,null,null,null,null,null,null,null,null,null,null,null,null,null,null,null,null,null,null,null,null,""]
[4,"How is chemistry controlled at melt, holding and pour furnace? Are SPC charts run? Is data readily available? What is used for traceability?",null,null,null,null,null,null,null,null,null,null,null,null,null,null,null,null,null,null,null,null,null,null,null,null,""]
[5,"How is microstructure checked and where in the process?",null,null,null,null,null,null,null,null,null,null,null,null,null,null,null,null,null,null,null,null,null,null,null,null,""]
[6,"What tests are performed and how for mechanical properties? Are test bars cast or machined?",null,null,null,null,null,null,null,null,null,null,null,null,null,null,null,null,null,null,null,null,null,null,null,null,""]
[7,"How are lots defined?",null,null,null,null,null,null,null,null,null,null,null,null,null,null,null,null,null,null,null,null,null,null,null,null,""]
[8,"What type of molding process is used (greensand or shell)?",null,null,null,null,null,null,null,null,null,null,null,null,null,null,null,null,null,null,null,null,null,null,null,null,""]
[9,"What type of molding equipment is used (Disa, SPO, Osborne etc.)? ",null,null,null,null,null,null,null,null,null,null,null,null,null,null,null,null,null,null,null,null,null,null,null,null,""]
[10,"How is sand monitored and controlled? Are sand checks documented and available for problem solving?",null,null,null,null,null,null,null,null,null,null,null,null,null,null,null,null,null,null,null,null,null,null,null,null,""]
[11,"Do you have coremaking and core setting capability? What type of coremaking (coldbox, hotbox etc.)?",null,null,null,null,null,null,null,null,null,null,null,null,null,null,null,null,null,null,null,null,null,null,null,null,""]
[12,"Is a core required or planned for this part? If yes are the coreprints designed to maintain dimensional control?",null,null,null,null,null,null,null,null,null,null,null,null,null,null,null,null,null,null,null,null,null,null,null,null,""]
[13,"Is tooling designed and built in house or outside? What material is used for the patterns? How many cycles are planned for maintenance, re-furb and new?",null,null,null,null,null,null,null,null,null,null,null,null,null,null,null,null,null,null,null,null,null,null,null,null,""]
[14,"Do you have tooling layout, casting layout and inspection capability using math data and 2D drawings? What type of CMM is used?",null,null,null,null,null,null,null,null,null,null,null,null,null,null,null,null,null,null,null,null,null,null,null,null,""]
[15,"How many cavities are planned for this part (both pattern and corebox if required)?",null,null,null,null,null,null,null,null,null,null,null,null,null,null,null,null,null,null,null,null,null,null,null,null,""]
[16,"What casting identification will be on the part (pattern number, core number, shift, date etc.)?",null,null,null,null,null,null,null,null,null,null,null,null,null,null,null,null,null,null,null,null,null,null,null,null,""]
[17,"Do you have mold fill and solidification simulation capability. Was it applied to this part?",null,null,null,null,null,null,null,null,null,null,null,null,null,null,null,null,null,null,null,null,null,null,null,null,""]
[18,"Has gating system been defined along with gate locations? Are filters used?",null,null,null,null,null,null,null,null,null,null,null,null,null,null,null,null,null,null,null,null,null,null,null,null,""]
[19,"What method / system is used for gate and fin removal?",null,null,null,null,null,null,null,null,null,null,null,null,null,null,null,null,null,null,null,null,null,null,null,null,""]
[20,"Do you have x-ray capability in-house or outside? What type film, digital or realtime?",null,null,null,null,null,null,null,null,null,null,null,null,null,null,null,null,null,null,null,null,null,null,null,null,""]
[21,"Do you have heat treat capability?",null,null,null,null,null,null,null,null,null,null,null,null,null,null,null,null,null,null,null,null,null,null,null,null,""]
[22,"If heat treat is required what process is used and how is it controlled and monitored? What defines a lot?",null,null,null,null,null,null,null,null,null,null,null,null,null,null,null,null,null,null,null,null,null,null,null,null,""]
[23,"How often and where are BHN checks made?",null,null,null,null,null,null,null,null,null,null,null,null,null,null,null,null,null,null,null,null,null,null,null,null,""]

{"sheet":"Machined Part","index":27,"n_rows":27,"n_cols":27,"rows_kept":27,"cut":false,"hidden":true,"merged":[[10,3,10,5],[11,3,11,5],[12,3,12,5],[13,3,13,5],[2,3,2,5],[3,3,3,5],[4,3,4,5],[5,3,5,5],[6,3,6,5],[7,3,7,5],[26,3,26,5],[0,2,0,8],[20,3,20,5],[21,3,21,5],[22,3,22,5],[23,3,23,5],[24,3,24,5],[25,3,25,5],[14,3,14,5],[15,3,15,5],[16,3,16,5],[17,3,17,5],[18,3,18,5],[19,3,19,5],[8,3,8,5],[9,3,9,5]]}
[null,null,"Machined Part Technical Supplement",null,null,null,null,null,null,null,null,null,null,null,null,null,null,null,null,null,null,null,null,null,null,null,{"$f":"'1-Program Info'!L24","v":"No"}]
[null,null," "]
["Item #","Nexteer Requirement","Supplier Response","Supplier Comments",null,null,"Mitigation Plan","Mitigation Plan Owner","Status\n(Nexteer AQE/SQE)"]
[1,"Do you understand that PPAP is machine specific?",null,null,null,null,null,null,null,null,null,null,null,null,null,null,null,null,null,null,null,null,null,null,null,null,{"$f":"IF($AA$1=\"Yes\",IF(OR(ISBLANK(I4),I4=\"Open\"),\"R\",IF(I4=\"Mitigation Plan Approved\",\"Y\",\"G\")),\"\")","v":""}]
[2,"Where do you buy raw materials?",null,null,null,null,null,null,null,null,null,null,null,null,null,null,null,null,null,null,null,null,null,null,null,null,{"$f":"IF($AA$1=\"Yes\",IF(OR(ISBLANK(I5),I5=\"Open\"),\"R\",IF(I5=\"Mitigation Plan Approved\",\"Y\",\"G\")),\"\")","v":""}]
[3,"How are incoming materials inspected?",null,null,null,null,null,null,null,null,null,null,null,null,null,null,null,null,null,null,null,null,null,null,null,null,""]
[4,"Is capitol equipment dedicated for this part? If equipment is existing, what will be the added % usage? How much time will be required for changeover? ",null,null,null,null,null,null,null,null,null,null,null,null,null,null,null,null,null,null,null,null,null,null,null,null,""]
[5,"How many different kinds of products can be manufactured in the same line?",null,null,null,null,null,null,null,null,null,null,null,null,null,null,null,null,null,null,null,null,null,null,null,null,""]
[6,"Do you produce similar parts today with similar tolerances?",null,null,null,null,null,null,null,null,null,null,null,null,null,null,null,null,null,null,null,null,null,null,null,null,""]
[7,"What is your FTQ on similar parts? What is your customer PPM?",null,null,null,null,null,null,null,null,null,null,null,null,null,null,null,null,null,null,null,null,null,null,null,null,""]
[8,"Define in the Process Flow Diagram how many machines are required for each operation.",null,null,null,null,null,null,null,null,null,null,null,null,null,null,null,null,null,null,null,null,null,null,null,null,""]
[9,"How many fixtures are there for each machine and load?",null,null,null,null,null,null,null,null,null,null,null,null,null,null,null,null,null,null,null,null,null,null,null,null,""]
[10,"How is traceability attained for each machine, fixture and date?",null,null,null,null,null,null,null,null,null,null,null,null,null,null,null,null,null,null,null,null,null,null,null,null,""]
[11,"Provide machining sequence chart for each operation.",null,null,null,null,null,null,null,null,null,null,null,null,null,null,null,null,null,null,null,null,null,null,null,null,""]
[12,"Is the environment appropriate in keeping the machine accuracy (vibration, heat, dust, etc.)? Is thermal compensation required and used?",null,null,null,null,null,null,null,null,null,null,null,null,null,null,null,null,null,null,null,null,null,null,null,null,""]
[13,"Is the cutting process of the material fully understood and controlled? How is the cutter maintained?",null,null,null,null,null,null,null,null,null,null,null,null,null,null,null,null,null,null,null,null,null,null,null,null,""]
[14,"What is the expected cutter exchange cycle?",null,null,null,null,null,null,null,null,null,null,null,null,null,null,null,null,null,null,null,null,null,null,null,null,""]
[15,"Do you expect part distortion due to clamping?",null,null,null,null,null,null,null,null,null,null,null,null,null,null,null,null,null,null,null,null,null,null,null,null,""]
[16,"How will machining chips be removed from the part?",null,null,null,null,null,null,null,null,null,null,null,null,null,null,null,null,null,null,null,null,null,null,null,null,""]
[17,"How will you provide a burr free part if required?",null,null,null,null,null,null,null,null,null,null,null,null,null,null,null,null,null,null,null,null,null,null,null,null,""]
[18,"How will you apply rust inhibitor for a ferrous part?",null,null,null,null,null,null,null,null,null,null,null,null,null,null,null,null,null,null,null,null,null,null,null,null,""]
[19,"How will you provide a dry part?",null,null,null,null,null,null,null,null,null,null,null,null,null,null,null,null,null,null,null,null,null,null,null,null,""]
[20,"What porosity specification will be used to evaluate parts after machining?",null,null,null,null,null,null,null,null,null,null,null,null,null,null,null,null,null,null,null,null,null,null,null,null,""]
[21,"Is the temperature of the measurement room controlled appropriately if applicable?",null,null,null,null,null,null,null,null,null,null,null,null,null,null,null,null,null,null,null,null,null,null,null,null,""]
[22,"Do you have a roundness measurement machine?",null,null,null,null,null,null,null,null,null,null,null,null,null,null,null,null,null,null,null,null,null,null,null,null,""]
[23,"Is leak test required? If yes what type will be used (air decay, water dunk)?",null,null,null,null,null,null,null,null,null,null,null,null,null,null,null,null,null,null,null,null,null,null,null,null,""]
[24,"In machining fixtures, is there a part seated sensor (back checked in logic for an off condition) to make sure the part is located correctly in the fixture prior to machining?",null,null,null,null,null,null,null,null,null,null,null,null,null,null,null,null,null,null,null,null,null,null,null,null,""]

{"sheet":"Plastic Molding","index":28,"n_rows":25,"n_cols":27,"rows_kept":25,"cut":false,"hidden":true,"merged":[[18,3,18,5],[19,3,19,5],[8,3,8,5],[9,3,9,5],[10,3,10,5],[11,3,11,5],[12,3,12,5],[13,3,13,5],[0,2,0,8],[14,3,14,5],[15,3,15,5],[16,3,16,5],[17,3,17,5],[2,3,2,5],[3,3,3,5],[4,3,4,5],[5,3,5,5],[6,3,6,5],[7,3,7,5],[20,3,20,5],[21,3,21,5],[22,3,22,5],[23,3,23,5],[24,3,24,5]]}
[null,null,"Plastic Molding Technical Supplement",null,null,null,null,null,null,null,null,null,null,null,null,null,null,null,null,null,null,null,null,null,null,null,{"$f":"'1-Program Info'!L22","v":"No"}]
[]
["Item #","Nexteer Requirement","Supplier Response","Supplier Comments",null,null,"Mitigation Plan","Mitigation Plan Owner","Status\n(Nexteer AQE/SQE)"]
[1,"What are your in house testing abilities (i.e. material analysis and molded part analysis)? Is an outside accredited lab used for any testing that is required?",null,null,null,null,null,null,null,null,null,null,null,null,null,null,null,null,null,null,null,null,null,null,null,null,{"$f":"IF($AA$1=\"Yes\",IF(OR(ISBLANK(I4),I4=\"Open\"),\"R\",IF(I4=\"Mitigation Plan Approved\",\"Y\",\"G\")),\"\")","v":""}]
[2,"For Resins and Polymers, are Tier II suppliers certified?",null,null,null,null,null,null,null,null,null,null,null,null,null,null,null,null,null,null,null,null,null,null,null,null,{"$f":"IF($AA$1=\"Yes\",IF(OR(ISBLANK(I5),I5=\"Open\"),\"R\",IF(I5=\"Mitigation Plan Approved\",\"Y\",\"G\")),\"\")","v":""}]
[3,"What percent of regrind is used? If the percent is not on the Nexteer drawing, then the proposed percent needs to be evaluated prior to PPAP. How will the regrind material be handled and stored?",null,null,null,null,null,null,null,null,null,null,null,null,null,null,null,null,null,null,null,null,null,null,null,null,""]
[4,"How do you keep track of the quality of the first trial product?  Are first trail samples retained during APQP for later MSA/GR&R ppap purposes?",null,null,null,null,null,null,null,null,null,null,null,null,null,null,null,null,null,null,null,null,null,null,null,null,""]
[5,"Is the environment appropriate in keeping the machine accuracy(vibration, heat, dust, etc.)?",null,null,null,null,null,null,null,null,null,null,null,null,null,null,null,null,null,null,null,null,null,null,null,null,""]
[6,"What is the % of yield rate?",null,null,null,null,null,null,null,null,null,null,null,null,null,null,null,null,null,null,null,null,null,null,null,null,""]
[7,"Is the material and material supplier currently approved for the Nexteer print material spec.?",null,null,null,null,null,null,null,null,null,null,null,null,null,null,null,null,null,null,null,null,null,null,null,null,""]
[8,"Is the process for removing products from the machines automated?",null,null,null,null,null,null,null,null,null,null,null,null,null,null,null,null,null,null,null,null,null,null,null,null,""]
[9,"What is the percentage of in-house versus outsourcing of tooling design and concept?",null,null,null,null,null,null,null,null,null,null,null,null,null,null,null,null,null,null,null,null,null,null,null,null,""]
[10,"How is tooling controlled and maintained(by person in charge of the line or centrally controlled?)",null,null,null,null,null,null,null,null,null,null,null,null,null,null,null,null,null,null,null,null,null,null,null,null,""]
[11,"Are there a lot of burrs on the product? (relates to insert molding)",null,null,null,null,null,null,null,null,null,null,null,null,null,null,null,null,null,null,null,null,null,null,null,null,""]
[12,"What is the current condition/status of the equipment?",null,null,null,null,null,null,null,null,null,null,null,null,null,null,null,null,null,null,null,null,null,null,null,null,""]
[13,"Do you have the ability to shape using two or more kinds of materials?",null,null,null,null,null,null,null,null,null,null,null,null,null,null,null,null,null,null,null,null,null,null,null,null,""]
[14,"How is damage to product prevented from ejection? Packaging?",null,null,null,null,null,null,null,null,null,null,null,null,null,null,null,null,null,null,null,null,null,null,null,null,""]
[15,"What are the raw material drying controls to ensure that the material is dry enough? Is the moisture content checked after drying? How is the dryer system set up (i.e. centralized, shared or dedicated)?",null,null,null,null,null,null,null,null,null,null,null,null,null,null,null,null,null,null,null,null,null,null,null,null,""]
[16,"How many materials(compounds) does the supplier handle?",null,null,null,null,null,null,null,null,null,null,null,null,null,null,null,null,null,null,null,null,null,null,null,null,""]
[17,"Are you capable of manufacturing products with inserts?",null,null,null,null,null,null,null,null,null,null,null,null,null,null,null,null,null,null,null,null,null,null,null,null,""]
[18,"Will cavity pressure sensors be implemented for this product at PPAP?",null,null,null,null,null,null,null,null,null,null,null,null,null,null,null,null,null,null,null,null,null,null,null,null,""]
[19,"What type(s) of equipment error-proofing is to be implemented for PPAP?  Please detail.",null,null,null,null,null,null,null,null,null,null,null,null,null,null,null,null,null,null,null,null,null,null,null,null,""]
[20,"For multiple assembly operations, will all processes be fully in place for the initial PPAP submission date?",null,null,null,null,null,null,null,null,null,null,null,null,null,null,null,null,null,null,null,null,null,null,null,null,""]
[21,"Are quick mold change practices utilized?",null,null,null,null,null,null,null,null,null,null,null,null,null,null,null,null,null,null,null,null,null,null,null,null,""]
[22,"What controls or monitoring techniques are in place to ensure that the melt is at the proper temperature in the barrel, at the nozzle, and in the mold cavity?",null,null,null,null,null,null,null,null,null,null,null,null,null,null,null,null,null,null,null,null,null,null,null,null,""]

{"sheet":"Powdered Metal","index":29,"n_rows":20,"n_cols":27,"rows_kept":20,"cut":false,"hidden":true,"merged":[[18,3,18,5],[19,3,19,5],[8,3,8,5],[9,3,9,5],[10,3,10,5],[11,3,11,5],[12,3,12,5],[13,3,13,5],[0,2,0,8],[14,3,14,5],[15,3,15,5],[16,3,16,5],[17,3,17,5],[2,3,2,5],[3,3,3,5],[4,3,4,5],[5,3,5,5],[6,3,6,5],[7,3,7,5]]}
[null,null,"Powdered Metal Technical Supplement",null,null,null,null,null,null,null,null,null,null,null,null,null,null,null,null,null,null,null,null,null,null,null,{"$f":"'1-Program Info'!L27","v":"No"}]
[]
["Item #","Nexteer Requirement","Supplier Response","Supplier Comments",null,null,"Mitigation Plan","Mitigation Plan Owner","Status\n(Nexteer AQE/SQE)"]
[1,"How do you prevent contamination of powder material in the hopper?",null,null,null,null,null,null,null,null,null,null,null,null,null,null,null,null,null,null,null,null,null,null,null,null,{"$f":"IF($AA$1=\"Yes\",IF(OR(ISBLANK(I4),I4=\"Open\"),\"R\",IF(I4=\"Mitigation Plan Approved\",\"Y\",\"G\")),\"\")","v":""}]
[2,"Is there continuous flow of powder from the hopper to the tube and press?",null,null,null,null,null,null,null,null,null,null,null,null,null,null,null,null,null,null,null,null,null,null,null,null,{"$f":"IF($AA$1=\"Yes\",IF(OR(ISBLANK(I5),I5=\"Open\"),\"R\",IF(I5=\"Mitigation Plan Approved\",\"Y\",\"G\")),\"\")","v":""}]
[3,"Does the powder shoe receive regular maintenance?  ",null,null,null,null,null,null,null,null,null,null,null,null,null,null,null,null,null,null,null,null,null,null,null,null,""]
[4,"Is there a possibililty that could cause green cracks from press to ejection, to conveyor, to deburr operation?",null,null,null,null,null,null,null,null,null,null,null,null,null,null,null,null,null,null,null,null,null,null,null,null,""]
[5,"At compacting operation how do you that confirm density requirements are met?",null,null,null,null,null,null,null,null,null,null,null,null,null,null,null,null,null,null,null,null,null,null,null,null,""]
[6,"Prior to sintering are there controls in place to minimize or protect against green cracks during part handling, part staging, in process dunnage, etc",null,null,null,null,null,null,null,null,null,null,null,null,null,null,null,null,null,null,null,null,null,null,null,null,""]
[7,"Is there a method/system to ensure the proper copper wafer or ring is installed and installed correctly?",null,null,null,null,null,null,null,null,null,null,null,null,null,null,null,null,null,null,null,null,null,null,null,null,""]
[8,"If copper infiltration is required, do you have a back up sinter belt",null,null,null,null,null,null,null,null,null,null,null,null,null,null,null,null,null,null,null,null,null,null,null,null,""]
[9,"How do you control distortion or flatness in the sinter furnace?",null,null,null,null,null,null,null,null,null,null,null,null,null,null,null,null,null,null,null,null,null,null,null,null,""]
[10,"Do you have a recent CQI-9 assessment or similar process certification for the sintering process?",null,null,null,null,null,null,null,null,null,null,null,null,null,null,null,null,null,null,null,null,null,null,null,null,""]
[11,"How is flatness controlled?",null,null,null,null,null,null,null,null,null,null,null,null,null,null,null,null,null,null,null,null,null,null,null,null,""]
[12,"How do you control the part density throughout the part thickness?  Is there a process to pull samples for each location?  Is the frequency adequate?  Is there a reaction plan for out of print conditions?",null,null,null,null,null,null,null,null,null,null,null,null,null,null,null,null,null,null,null,null,null,null,null,null,""]
[13,"How do you control the net formed features? ",null,null,null,null,null,null,null,null,null,null,null,null,null,null,null,null,null,null,null,null,null,null,null,null,""]
[14,"Is there a method used to check for green cracks?",null,null,null,null,null,null,null,null,null,null,null,null,null,null,null,null,null,null,null,null,null,null,null,null,""]
[15,"If you perform Magnetic Particle inspection did you verify that the inspector has passed a vision and color blindness test. ",null,null,null,null,null,null,null,null,null,null,null,null,null,null,null,null,null,null,null,null,null,null,null,null,""]
[16,"Do you check for residual magnetism?",null,null,null,null,null,null,null,null,null,null,null,null,null,null,null,null,null,null,null,null,null,null,null,null,""]
[17,"Do you have a method to ensure that no tumbling media is lodged in the part?",null,null,null,null,null,null,null,null,null,null,null,null,null,null,null,null,null,null,null,null,null,null,null,null,""]

{"sheet":"Press Fit","index":30,"n_rows":12,"n_cols":27,"rows_kept":12,"cut":false,"hidden":true,"merged":[[8,3,8,5],[9,3,9,5],[10,3,10,5],[11,3,11,5],[0,2,0,8],[2,3,2,5],[3,3,3,5],[4,3,4,5],[5,3,5,5],[6,3,6,5],[7,3,7,5]]}
[null,null," Press Fit Technical Supplement",null,null,null,null,null,null,null,null,null,null,null,null,null,null,null,null,null,null,null,null,null,null,null,{"$f":"'1-Program Info'!L28","v":"No"}]
[]
["Item #","Nexteer Requirement","Supplier Response","Supplier Comments",null,null,"Mitigation Plan","Mitigation Plan Owner","Status\n(Nexteer AQE/SQE)"]
[1,"Does error proofing exist for the presence & orientation if applicable for all parts? Look for the error proofing masters and a check sheet for their function.",null,null,null,null,null,null,null,null,null,null,null,null,null,null,null,null,null,null,null,null,null,null,null,null,{"$f":"IF($AA$1=\"Yes\",IF(OR(ISBLANK(I4),I4=\"Open\"),\"R\",IF(I4=\"Mitigation Plan Approved\",\"Y\",\"G\")),\"\")","v":""}]
[2,"Does the equipment check and record the press load and displacement  profile for each assembly? Look for the record. If not present then the load and displacement profile must be added for all parts with a severity of 9 or 10. For severities of less than 9 other methods may be used.",null,null,null,null,null,null,null,null,null,null,null,null,null,null,null,null,null,null,null,null,null,null,null,null,{"$f":"IF($AA$1=\"Yes\",IF(OR(ISBLANK(I5),I5=\"Open\"),\"R\",IF(I5=\"Mitigation Plan Approved\",\"Y\",\"G\")),\"\")","v":""}]
[3,"Is data for critical dimensions retained for length of program +5 years on customers except for BMW which requires +15 years? Look for stored data by date.If not present for parts with severities of 8, 9 or 10, then it must be added.",null,null,null,null,null,null,null,null,null,null,null,null,null,null,null,null,null,null,null,null,null,null,null,null,""]
[4,"For displacement monitoring how is it calibrated and how often? Look for displacement masters and frequency of checking.",null,null,null,null,null,null,null,null,null,null,null,null,null,null,null,null,null,null,null,null,null,null,null,null,""]
[5,"How is the load cell calibrated and how often? Look for method(another certified load cell) and frequency(100,000 cycles or as suggested from load cell manufacturer) on the contol plan",null,null,null,null,null,null,null,null,null,null,null,null,null,null,null,null,null,null,null,null,null,null,null,null,""]
[6,"How are defective parts handled? Refer to G-1331 attachment E in the MAPP document.",null,null,null,null,null,null,null,null,null,null,null,null,null,null,null,null,null,null,null,null,null,null,null,null,""]
[7,"Are rejected assemblies reworked? On rejected parts no rework is permitted unless G-1331 Attachment E allows it. Rework must be approved by the Nexteer AQE/SQE.",null,null,null,null,null,null,null,null,null,null,null,null,null,null,null,null,null,null,null,null,null,null,null,null,""]
[8,"If the machine cycle is interrupted are parts rejected? In the case of a cycle interruption the parts are not to be reused unless G-1331 Attachment E allows it. Rework must be approved by the Nexteer AQE/SQE.",null,null,null,null,null,null,null,null,null,null,null,null,null,null,null,null,null,null,null,null,null,null,null,null,""]
[9,"For situations that may involve bearing cracking or peeling during the pressing operation do you use a video camera or other method to monitor the operation?",null,null,null,null,null,null,null,null,null,null,null,null,null,null,null,null,null,null,null,null,null,null,null,null,""]

{"sheet":"Projection Welding","index":31,"n_rows":26,"n_cols":27,"rows_kept":26,"cut":false,"hidden":true,"merged":[[7,3,7,5],[24,3,24,5],[25,3,25,5],[14,3,14,5],[15,3,15,5],[16,3,16,5],[17,3,17,5],[18,3,18,5],[19,3,19,5],[0,2,0,8],[20,3,20,5],[21,3,21,5],[22,3,22,5],[23,3,23,5],[8,3,8,5],[9,3,9,5],[10,3,10,5],[11,3,11,5],[12,3,12,5],[13,3,13,5],[2,3,2,5],[3,3,3,5],[4,3,4,5],[5,3,5,5],[6,3,6,5]]}
[null,null,"Projection Welding Technical Supplement",null,null,null,null,null,null,null,null,null,null,null,null,null,null,null,null,null,null,null,null,null,null,null,{"$f":"'1-Program Info'!L29","v":"No"}]
[]
["Item #","Nexteer Requirement","Supplier Response","Supplier Comments",null,null,"Mitigation Plan","Mitigation Plan Owner","Status\n(Nexteer AQE/SQE)"]
[1,"Do you have process Limits on the weld current? ( Not just a target value) ",null,null,null,null,null,null,null,null,null,null,null,null,null,null,null,null,null,null,null,null,null,null,null,null,{"$f":"IF($AA$1=\"Yes\",IF(OR(ISBLANK(I4),I4=\"Open\"),\"R\",IF(I4=\"Mitigation Plan Approved\",\"Y\",\"G\")),\"\")","v":""}]
[2,"Do you have process limits on the weld time?  (Not just a target value)",null,null,null,null,null,null,null,null,null,null,null,null,null,null,null,null,null,null,null,null,null,null,null,null,{"$f":"IF($AA$1=\"Yes\",IF(OR(ISBLANK(I5),I5=\"Open\"),\"R\",IF(I5=\"Mitigation Plan Approved\",\"Y\",\"G\")),\"\")","v":""}]
[3,"Do you use a weld monitor for the applied power?  ",null,null,null,null,null,null,null,null,null,null,null,null,null,null,null,null,null,null,null,null,null,null,null,null,""]
[4,"Do you use a weld signature with ramp up, min, max and ramp down?",null,null,null,null,null,null,null,null,null,null,null,null,null,null,null,null,null,null,null,null,null,null,null,null,""]
[5,"If set to max power (current) at max time, will it create a burn through condition?",null,null,null,null,null,null,null,null,null,null,null,null,null,null,null,null,null,null,null,null,null,null,null,null,""]
[6,"Is the electrode design documented on a tooling print?",null,null,null,null,null,null,null,null,null,null,null,null,null,null,null,null,null,null,null,null,null,null,null,null,""]
[7,"Is the electrode replacement / resurfacing tied to specific number of welds?  (10,000 is a good starting point if nothing else is known)",null,null,null,null,null,null,null,null,null,null,null,null,null,null,null,null,null,null,null,null,null,null,null,null,""]
[8,"Is the position of the component nests and weld fixtures controlled within limits?",null,null,null,null,null,null,null,null,null,null,null,null,null,null,null,null,null,null,null,null,null,null,null,null,""]
[9,"Are component nests and weld fixtures documented on tooling prints?",null,null,null,null,null,null,null,null,null,null,null,null,null,null,null,null,null,null,null,null,null,null,null,null,""]
[10,"Do you use visual scoring or equivalent for the heat affected zone?",null,null,null,null,null,null,null,null,null,null,null,null,null,null,null,null,null,null,null,null,null,null,null,null,""]
[11,"Is there a nondestructive method to view both sides of the weld?  ",null,null,null,null,null,null,null,null,null,null,null,null,null,null,null,null,null,null,null,null,null,null,null,null,""]
[12,"Is a weld section analysis done at set up and every hour there after?  ",null,null,null,null,null,null,null,null,null,null,null,null,null,null,null,null,null,null,null,null,null,null,null,null,""]
[13,"Is there an in-process gauge to check the as welded position of the subassembly?   ",null,null,null,null,null,null,null,null,null,null,null,null,null,null,null,null,null,null,null,null,null,null,null,null,""]
[14,"Do you maintain an FTQ chart for weld rejects?",null,null,null,null,null,null,null,null,null,null,null,null,null,null,null,null,null,null,null,null,null,null,null,null,""]
[15,"Are FTQ Alarm limits set to \"1\" reject piece for non-chronic failures?",null,null,null,null,null,null,null,null,null,null,null,null,null,null,null,null,null,null,null,null,null,null,null,null,""]
[16,"Do you routinely do tear down analysis of good parts looking for variation?",null,null,null,null,null,null,null,null,null,null,null,null,null,null,null,null,null,null,null,null,null,null,null,null,""]
[17,"If the welded assembly carries fluid, is the subassembly 100% leak tested?",null,null,null,null,null,null,null,null,null,null,null,null,null,null,null,null,null,null,null,null,null,null,null,null,""]
[18,"Is the leak test done prior to plating or coating ?",null,null,null,null,null,null,null,null,null,null,null,null,null,null,null,null,null,null,null,null,null,null,null,null,""]
[19,"Do you have a divisional technical center or product development center with additional resources?  If so, what types of equipment and testing capabilities do you have and what types of technical personnel do you have?",null,null,null,null,null,null,null,null,null,null,null,null,null,null,null,null,null,null,null,null,null,null,null,null,""]
[20,"Explain what you define as a “lot” of material for the various areas of their process (incoming lot of material, lot of heat treat, etc).",null,null,null,null,null,null,null,null,null,null,null,null,null,null,null,null,null,null,null,null,null,null,null,null,""]
[21,"Do you currently produce any structural components for Nexteer or other customers?",null,null,null,null,null,null,null,null,null,null,null,null,null,null,null,null,null,null,null,null,null,null,null,null,""]
[22,"What types of error proofing are used?",null,null,null,null,null,null,null,null,null,null,null,null,null,null,null,null,null,null,null,null,null,null,null,null,""]
[23,"Do you have a CQI-15 welding assessment?",null,null,null,null,null,null,null,null,null,null,null,null,null,null,null,null,null,null,null,null,null,null,null,null,""]

{"sheet":"Rubber","index":32,"n_rows":20,"n_cols":27,"rows_kept":20,"cut":false,"hidden":true,"merged":[[18,3,18,5],[19,3,19,5],[8,3,8,5],[9,3,9,5],[10,3,10,5],[11,3,11,5],[12,3,12,5],[13,3,13,5],[0,2,0,8],[14,3,14,5],[15,3,15,5],[16,3,16,5],[17,3,17,5],[2,3,2,5],[3,3,3,5],[4,3,4,5],[5,3,5,5],[6,3,6,5],[7,3,7,5]]}
[null,null,"Rubber Technical Supplement",null,null,null,null,null,null,null,null,null,null,null,null,null,null,null,null,null,null,null,null,null,null,null,{"$f":"'1-Program Info'!L30","v":"No"}]
[]
["Item #","Nexteer Requirement","Supplier Response","Supplier Comments",null,null,"Mitigation Plan","Mitigation Plan Owner","Status\n(Nexteer AQE/SQE)"]
[1,"Who will be mixing the rubber material and at what location? Are the curatives added to the compound at the molding site?",null,null,null,null,null,null,null,null,null,null,null,null,null,null,null,null,null,null,null,null,null,null,null,null,{"$f":"IF($AA$1=\"Yes\",IF(OR(ISBLANK(I4),I4=\"Open\"),\"R\",IF(I4=\"Mitigation Plan Approved\",\"Y\",\"G\")),\"\")","v":""}]
[2,"What is the traceability system that is used from the mixing process to the shipping of the final product to the customer?",null,null,null,null,null,null,null,null,null,null,null,null,null,null,null,null,null,null,null,null,null,null,null,null,{"$f":"IF($AA$1=\"Yes\",IF(OR(ISBLANK(I5),I5=\"Open\"),\"R\",IF(I5=\"Mitigation Plan Approved\",\"Y\",\"G\")),\"\")","v":""}]
[3,"Do you have a test facility for rubber (both raw and finished material)? What type of testing is done? What is the frequency of testing?",null,null,null,null,null,null,null,null,null,null,null,null,null,null,null,null,null,null,null,null,null,null,null,null,""]
[4,"Do you have the ability to check parts for mechanical properties (hardness, elongation, modulus, etc.) at the manufacturing site?",null,null,null,null,null,null,null,null,null,null,null,null,null,null,null,null,null,null,null,null,null,null,null,null,""]
[5,"Do you have equipment to check the rubber parts for IRHDM hardness? (Required when part section is 3mm or less)",null,null,null,null,null,null,null,null,null,null,null,null,null,null,null,null,null,null,null,null,null,null,null,null,""]
[6,"Is there a shelf life of the material?  Also explain control of material expiration and how you follow the FIFO system for this material.",null,null,null,null,null,null,null,null,null,null,null,null,null,null,null,null,null,null,null,null,null,null,null,null,""]
[7,"What kind of error proofing is in place to make sure that right material/ ingredient is used?",null,null,null,null,null,null,null,null,null,null,null,null,null,null,null,null,null,null,null,null,null,null,null,null,""]
[8,"What type of molding process will be used (i.e. injection molding, compression molding, etc)? If compression molding, will loading boards be used?",null,null,null,null,null,null,null,null,null,null,null,null,null,null,null,null,null,null,null,null,null,null,null,null,""]
[9,"How do you eliminate voids/burns/excessive flash?",null,null,null,null,null,null,null,null,null,null,null,null,null,null,null,null,null,null,null,null,null,null,null,null,""]
[10,"What kind of controls are in place to alert the operator should there be excessive temperature variation in the mold?",null,null,null,null,null,null,null,null,null,null,null,null,null,null,null,null,null,null,null,null,null,null,null,null,""]
[11,"Are cleaning and other PM work done in house? If not where?",null,null,null,null,null,null,null,null,null,null,null,null,null,null,null,null,null,null,null,null,null,null,null,null,""]
[12,"Do you utilize a quick tool change over process?",null,null,null,null,null,null,null,null,null,null,null,null,null,null,null,null,null,null,null,null,null,null,null,null,""]
[13,"How do you deflash the parts?",null,null,null,null,null,null,null,null,null,null,null,null,null,null,null,null,null,null,null,null,null,null,null,null,""]
[14,"Do you have equipment error proofing installed for the initial PPAP run through production?",null,null,null,null,null,null,null,null,null,null,null,null,null,null,null,null,null,null,null,null,null,null,null,null,""]
[15,"Does the proposed compound flow well in the tool?  Is the material sensitive to scorching?",null,null,null,null,null,null,null,null,null,null,null,null,null,null,null,null,null,null,null,null,null,null,null,null,""]
[16,"Can the compound ingredients be obtained from more than one source?",null,null,null,null,null,null,null,null,null,null,null,null,null,null,null,null,null,null,null,null,null,null,null,null,""]
[17,"Does this part require a post cure operation?",null,null,null,null,null,null,null,null,null,null,null,null,null,null,null,null,null,null,null,null,null,null,null,null,""]

{"sheet":"Squeeze Cast","index":33,"n_rows":37,"n_cols":27,"rows_kept":37,"cut":false,"hidden":true,"merged":[[13,3,13,5],[2,3,2,5],[3,3,3,5],[4,3,4,5],[5,3,5,5],[6,3,6,5],[7,3,7,5],[30,3,30,5],[31,3,31,5],[20,3,20,5],[21,3,21,5],[22,3,22,5],[23,3,23,5],[24,3,24,5],[25,3,25,5],[0,2,0,8],[26,3,26,5],[27,3,27,5],[28,3,28,5],[29,3,29,5],[14,3,14,5],[15,3,15,5],[16,3,16,5],[17,3,17,5],[18,3,18,5],[19,3,19,5],[8,3,8,5],[9,3,9,5],[10,3,10,5],[11,3,11,5],[12,3,12,5],[32,3,32,5],[33,3,33,5],[34,3,34,5],[35,3,35,5],[36,3,36,5]]}
[null,null,"Squeeze Cast Technical Supplement",null,null,null,null,null,null,null,null,null,null,null,null,null,null,null,null,null,null,null,null,null,null,null,{"$f":"'1-Program Info'!L33","v":"No"}]
[]
["Item #","Nexteer Requirement","Supplier Response","Supplier Comments",null,null,"Mitigation Plan","Mitigation Plan Owner","Status\n(Nexteer AQE/SQE)"]
[1,"What alloys do you typically cast and heat treat?",null,null,null,null,null,null,null,null,null,null,null,null,null,null,null,null,null,null,null,null,null,null,null,null,{"$f":"IF($AA$1=\"Yes\",IF(OR(ISBLANK(I4),I4=\"Open\"),\"R\",IF(I4=\"Mitigation Plan Approved\",\"Y\",\"G\")),\"\")","v":""}]
[2,"How is charge material, re-melt and different alloys segregated?",null,null,null,null,null,null,null,null,null,null,null,null,null,null,null,null,null,null,null,null,null,null,null,null,{"$f":"IF($AA$1=\"Yes\",IF(OR(ISBLANK(I5),I5=\"Open\"),\"R\",IF(I5=\"Mitigation Plan Approved\",\"Y\",\"G\")),\"\")","v":""}]
[3,"How is incoming material checked? Is it certified?",null,null,null,null,null,null,null,null,null,null,null,null,null,null,null,null,null,null,null,null,null,null,null,null,""]
[4,"What type of melting furnace / process is used?",null,null,null,null,null,null,null,null,null,null,null,null,null,null,null,null,null,null,null,null,null,null,null,null,""]
[5,"How is metal transferred to holding furnace at squeeze cast machines (ladle, launder, etc.)?",null,null,null,null,null,null,null,null,null,null,null,null,null,null,null,null,null,null,null,null,null,null,null,null,""]
[6,"How is chemistry checked at melting furnace and squeeze cast machines? What frequency and is it SPC charted?",null,null,null,null,null,null,null,null,null,null,null,null,null,null,null,null,null,null,null,null,null,null,null,null,""]
[7,"How is microstructure checked? Is the lab and operator(s) certified?",null,null,null,null,null,null,null,null,null,null,null,null,null,null,null,null,null,null,null,null,null,null,null,null,""]
[8,"How are mechanical properties checked? Are test bars cast or machined? Is data stored and readily available?",null,null,null,null,null,null,null,null,null,null,null,null,null,null,null,null,null,null,null,null,null,null,null,null,""]
[9,"How are casting lots defined (hours, pieces, shift)?",null,null,null,null,null,null,null,null,null,null,null,null,null,null,null,null,null,null,null,null,null,null,null,null,""]
[10,"How is the melt de-gassed? How and when is density checked?",null,null,null,null,null,null,null,null,null,null,null,null,null,null,null,null,null,null,null,null,null,null,null,null,""]
[11,"What tonnage squeeze cast machine will be used? What type horizontal or vertical / cold or hot chamber? Is it fully automated such as die lube and casting extraction and trim? If not automated is die lube manual, fixed manifold or flexible nozzles? Are castings air cooled or quenched?",null,null,null,null,null,null,null,null,null,null,null,null,null,null,null,null,null,null,null,null,null,null,null,null,""]
[12,"How is metal transferred to squeeze cast machine shot sleeve (ladle, pump, etc.)? What is done to minimize inclusions?",null,null,null,null,null,null,null,null,null,null,null,null,null,null,null,null,null,null,null,null,null,null,null,null,""]
[13,"What is max. shot intensification pressure and cavity pressure?",null,null,null,null,null,null,null,null,null,null,null,null,null,null,null,null,null,null,null,null,null,null,null,null,""]
[14,"How is biscuit length controlled?",null,null,null,null,null,null,null,null,null,null,null,null,null,null,null,null,null,null,null,null,null,null,null,null,""]
[15,"What type of die lubricant is used? What will be done to prevent die lube inclusions? Do you plan on a fixed lube manifold? Is the die lube abrasive and if yes what controls will be in place to monitor nozzle wear?",null,null,null,null,null,null,null,null,null,null,null,null,null,null,null,null,null,null,null,null,null,null,null,null,""]
[16,"Do you have squeeze pin capability? Will it be applied to this part?",null,null,null,null,null,null,null,null,null,null,null,null,null,null,null,null,null,null,null,null,null,null,null,null,""]
[17,"Are dies designed and built in house or outside?",null,null,null,null,null,null,null,null,null,null,null,null,null,null,null,null,null,null,null,null,null,null,null,null,""]
[18,"Do you have tooling layout, casting layout and inspection capability using math data and 2D drawings? What type of CMM is used?",null,null,null,null,null,null,null,null,null,null,null,null,null,null,null,null,null,null,null,null,null,null,null,null,""]
[19,"What die cavity material is used?",null,null,null,null,null,null,null,null,null,null,null,null,null,null,null,null,null,null,null,null,null,null,null,null,""]
[20,"How many cavities are planned and number of slides and core pulls?",null,null,null,null,null,null,null,null,null,null,null,null,null,null,null,null,null,null,null,null,null,null,null,null,""]
[21,"What casting identification will be on the part (cavity number, shift, date etc.)?",null,null,null,null,null,null,null,null,null,null,null,null,null,null,null,null,null,null,null,null,null,null,null,null,""]
[22,"Do you have die fill simulation capability in house or outside? Will it be applied to this part?",null,null,null,null,null,null,null,null,null,null,null,null,null,null,null,null,null,null,null,null,null,null,null,null,""]
[23,"Are gate and vent locations defined?",null,null,null,null,null,null,null,null,null,null,null,null,null,null,null,null,null,null,null,null,null,null,null,null,""]
[24,"What type of die cooling system is used (water, oil or combined)? If water is used is it treated? What type of die temperature methods / controls are used?",null,null,null,null,null,null,null,null,null,null,null,null,null,null,null,null,null,null,null,null,null,null,null,null,""]
[25,"How is tooling controlled? What are the typical number of shots for inspection, re-furbish and new? How was replacement dies quoted?",null,null,null,null,null,null,null,null,null,null,null,null,null,null,null,null,null,null,null,null,null,null,null,null,""]
[26,"Do you have x-ray capability in house or outside? Is it certified? Is it film, digital or real time?",null,null,null,null,null,null,null,null,null,null,null,null,null,null,null,null,null,null,null,null,null,null,null,null,""]
[27,"Do you have heat treat capability in house or outside? Do you have a metallurgist on site?",null,null,null,null,null,null,null,null,null,null,null,null,null,null,null,null,null,null,null,null,null,null,null,null,""]
[28,"What studies have been done to optimize mechanical properties? What is the audit frequency and part selection plan? What error proofing is in place for each step in the heat treat process?",null,null,null,null,null,null,null,null,null,null,null,null,null,null,null,null,null,null,null,null,null,null,null,null,""]
[29,"What traceability is used for heat treat lots. What size are lots?",null,null,null,null,null,null,null,null,null,null,null,null,null,null,null,null,null,null,null,null,null,null,null,null,""]
[30,"How often is the temperature profile of the furnaces checked?",null,null,null,null,null,null,null,null,null,null,null,null,null,null,null,null,null,null,null,null,null,null,null,null,""]
[31,"Do you have die penetrant capability such as Zyglo?",null,null,null,null,null,null,null,null,null,null,null,null,null,null,null,null,null,null,null,null,null,null,null,null,""]
[32,"Do you have shot blast capability? Was it included in the quote?",null,null,null,null,null,null,null,null,null,null,null,null,null,null,null,null,null,null,null,null,null,null,null,null,""]
[33,"Do you have leak test capability (air decay, water dunk)?",null,null,null,null,null,null,null,null,null,null,null,null,null,null,null,null,null,null,null,null,null,null,null,null,""]
[34,"Do you have impregnation capability? Is it planned for this part and if yes why?",null,null,null,null,null,null,null,null,null,null,null,null,null,null,null,null,null,null,null,null,null,null,null,null,""]

{"sheet":"Stamping 1 of 2","index":34,"n_rows":28,"n_cols":27,"rows_kept":28,"cut":false,"hidden":true,"merged":[[7,3,7,5],[2,3,2,5],[3,3,3,5],[4,3,4,5],[5,3,5,5],[6,3,6,5],[9,3,9,5],[10,3,10,5],[11,3,11,5],[12,3,12,5],[13,3,13,5],[26,3,26,5],[27,3,27,5],[0,2,0,8],[20,3,20,5],[21,3,21,5],[22,3,22,5],[23,3,23,5],[24,3,24,5],[25,3,25,5],[14,3,14,5],[15,3,15,5],[16,3,16,5],[17,3,17,5],[18,3,18,5],[19,3,19,5],[8,3,8,5]]}
[null,null,"Stamping Technical Supplement",null,null,null,null,null,null,null,null,null,null,null,null,null,null,null,null,null,null,null,null,null,null,null,{"$f":"'1-Program Info'!L34","v":"No"}]
[]
["Item #","Nexteer Requirement","Supplier Response","Supplier Comments",null,null,"Mitigation Plan","Mitigation Plan Owner","Status\n(Nexteer AQE/SQE)"]
[1,"Do you use a single or progressive die?",null,null,null,null,null,null,null,null,null,null,null,null,null,null,null,null,null,null,null,null,null,null,null,null,{"$f":"IF($AA$1=\"Yes\",IF(OR(ISBLANK(I4),I4=\"Open\"),\"R\",IF(I4=\"Mitigation Plan Approved\",\"Y\",\"G\")),\"\")","v":""}]
[2,"Is the Die a multiple part out Die (ie. Two parts per stroke)?",null,null,null,null,null,null,null,null,null,null,null,null,null,null,null,null,null,null,null,null,null,null,null,null,{"$f":"IF($AA$1=\"Yes\",IF(OR(ISBLANK(I5),I5=\"Open\"),\"R\",IF(I5=\"Mitigation Plan Approved\",\"Y\",\"G\")),\"\")","v":""}]
[3,"In the multiple part out die, is the part marked so that you know which position the part is from inside the die?",null,null,null,null,null,null,null,null,null,null,null,null,null,null,null,null,null,null,null,null,null,null,null,null,""]
[4,"What is the press tonnage and how many of that size are in the  facility?",null,null,null,null,null,null,null,null,null,null,null,null,null,null,null,null,null,null,null,null,null,null,null,null,""]
[5,"What variable gaging will be used?",null,null,null,null,null,null,null,null,null,null,null,null,null,null,null,null,null,null,null,null,null,null,null,null,""]
[6,"What is your contingency plan when the machines/presses break down?  Will the replacement press be bigger?  Smaller?  Will they plan to PPAP it as a back-up?",null,null,null,null,null,null,null,null,null,null,null,null,null,null,null,null,null,null,null,null,null,null,null,null,""]
[7,"Will you keep the first and last piece and web until the next run?",null,null,null,null,null,null,null,null,null,null,null,null,null,null,null,null,null,null,null,null,null,null,null,null,""]
[8,"Do you have the ability to contain parts properly until the batch is \"certified\"?",null,null,null,null,null,null,null,null,null,null,null,null,null,null,null,null,null,null,null,null,null,null,null,null,""]
[9,"Discuss the direction of the punching in the die and in the tapping operation if applicable. Will burrs be an issue?",null,null,null,null,null,null,null,null,null,null,null,null,null,null,null,null,null,null,null,null,null,null,null,null,""]
[10,"How will sharp edges be addressed?  If parts are deburred is bending a potential?",null,null,null,null,null,null,null,null,null,null,null,null,null,null,null,null,null,null,null,null,null,null,null,null,""]
[11,"Do current products have a lot of burr issues? ",null,null,null,null,null,null,null,null,null,null,null,null,null,null,null,null,null,null,null,null,null,null,null,null,""]
[12,"How many different kinds of products can be produced on the same line?",null,null,null,null,null,null,null,null,null,null,null,null,null,null,null,null,null,null,null,null,null,null,null,null,""]
[13,"What % of your products are welded assemblies? What % are stampings only? ",null,null,null,null,null,null,null,null,null,null,null,null,null,null,null,null,null,null,null,null,null,null,null,null,""]
[14,"If welding is not performed, why not?",null,null,null,null,null,null,null,null,null,null,null,null,null,null,null,null,null,null,null,null,null,null,null,null,""]
[15,"Is the stamping process of the material fully understood and controlled? How is the cutting edges maintained?",null,null,null,null,null,null,null,null,null,null,null,null,null,null,null,null,null,null,null,null,null,null,null,null,""]
[16,"How do you keep track of the quality of the first trial product?",null,null,null,null,null,null,null,null,null,null,null,null,null,null,null,null,null,null,null,null,null,null,null,null,""]
[17,"How and what do you inspect for incoming materials?",null,null,null,null,null,null,null,null,null,null,null,null,null,null,null,null,null,null,null,null,null,null,null,null,""]
[18,"Is the environment appropriate in keeping the machine accuracy(vibration, heat, dust, etc.)?",null,null,null,null,null,null,null,null,null,null,null,null,null,null,null,null,null,null,null,null,null,null,null,null,""]
[19,"What is the typical % of yield rate?",null,null,null,null,null,null,null,null,null,null,null,null,null,null,null,null,null,null,null,null,null,null,null,null,""]
[20,"Where do you buy their raw materials?",null,null,null,null,null,null,null,null,null,null,null,null,null,null,null,null,null,null,null,null,null,null,null,null,""]
[21,"Is the process for removing products from the machines automated?",null,null,null,null,null,null,null,null,null,null,null,null,null,null,null,null,null,null,null,null,null,null,null,null,""]
[22,"What is the percentage of in-house versus outsourcing of tooling design and concept?",null,null,null,null,null,null,null,null,null,null,null,null,null,null,null,null,null,null,null,null,null,null,null,null,""]
[23,"How is tooling controlled and maintained(by person in charge of the line or centrally controlled)?",null,null,null,null,null,null,null,null,null,null,null,null,null,null,null,null,null,null,null,null,null,null,null,null,""]
[24,"Where do you buy your equipment? ",null,null,null,null,null,null,null,null,null,null,null,null,null,null,null,null,null,null,null,null,null,null,null,null,""]
[25,"What is the current condition of your equipment?",null,null,null,null,null,null,null,null,null,null,null,null,null,null,null,null,null,null,null,null,null,null,null,null,""]

{"sheet":"Stamping 2 of 2","index":35,"n_rows":27,"n_cols":8,"rows_kept":27,"cut":false,"hidden":true,"merged":[[26,2,26,7],[4,2,4,7],[16,2,16,7],[19,2,19,7],[5,2,5,3],[6,2,6,3],[7,2,7,3],[8,2,8,3],[9,2,9,3],[10,2,10,3],[11,2,11,3],[12,2,12,3],[13,2,13,3],[20,2,20,7],[24,2,24,7]]}
[]
[]
["STAMPING  GAGE  &  PROCESSING  GUIDELINE"]
[null,"KPC’s, QCI’s, and QCL's "]
[null,null,"è  Supplier needs to recommend reduced tolerance attribute gages for process control with timing and any comments:"]
[null,null,"Gage Description",null,null,"Leadtime (wks)",null,"Comments"]
[]
[]
[]
[]
[]
[]
[]
[]
[]
[null,"Tooth Forms"]
[null,null,"è  Comparator checking method required at 75% of tolerance "]
[]
[null,"Processing Note "]
[null,null,"è   If heat treating is required for a given component then green state process monitoring and post heat treat process monitoring is required in the format of full SPC charting."]
[]
["DIE SENSORING GUIDELINE"]
[]
[null,"KPC’s, QCI’s, QCL's and Pass-Thru Features"]
[null,null,"è   In die sensoring proposals are preferred prior to the technical review in order to determine the best cost effective method. In die sensoring proposals are required to be submitted to and approved by the Nexteer AQE prior to the award of business."]
[]
[null,null,"è   Concept die strip layouts are required to be submitted to and approved by the Nexteer AQE prior to technical review. The die strip diagram shall demonstrate how the datum structure is translated from the print to the die, and illustrate where the severity ≥ 7 characteristics are formed."]

{"sheet":"Steel Quality","index":36,"n_rows":35,"n_cols":27,"rows_kept":35,"cut":false,"hidden":true,"merged":[[2,3,2,5],[3,3,3,5],[4,3,4,5],[5,3,5,5],[6,3,6,5],[13,3,13,5],[14,3,14,5],[15,3,15,5],[32,3,32,5],[7,3,7,5],[8,3,8,5],[9,3,9,5],[10,3,10,5],[11,3,11,5],[16,3,16,5],[18,3,18,5],[19,3,19,5],[20,3,20,5],[21,3,21,5],[33,3,33,5],[0,2,0,8],[1,2,1,8],[34,0,34,8],[27,3,27,5],[28,3,28,5],[29,3,29,5],[30,3,30,5],[31,3,31,5],[22,3,22,5],[23,3,23,5],[24,3,24,5],[25,3,25,5],[26,3,26,5],[17,3,17,5],[12,3,12,5]]}
[null,null,"Steel Quality Technical Supplement",null,null,null,null,null,null,null,null,null,null,null,null,null,null,null,null,null,null,null,null,null,null,null,{"$f":"'1-Program Info'!L35","v":"No"}]
[null,null,"for conformance to Material Specification 33200011"]
["Item #","Nexteer Requirement","Supplier Response","Supplier Comments",null,null,"Mitigation Plan","Mitigation Plan Owner","Status\n(Nexteer AQE/SQE)"]
[1,"Who is the supplier of the raw steel and their location? If there are multiple suppliers list them all and if each supplier has multiple locations list all that apply.",null,null,null,null,null,null,null,null,null,null,null,null,null,null,null,null,null,null,null,null,null,null,null,null,{"$f":"IF($AA$1=\"Yes\",IF(OR(ISBLANK(I4),I4=\"Open\"),\"R\",IF(I4=\"Mitigation Plan Approved\",\"Y\",\"G\")),\"\")","v":""}]
[2,"Do you understand that any changes in the steel manufacturing process requires a Supplier Change Request (SCR) to Nexteer Supplier Quality through the Supplier website? Refer to Nexteer.com -> Suppliers to review the Nexteer Supplier Requirements (NSR) in the section \"Doing Business with Nexteer\". Refer to the Change Management of the NSR for further information.",null,null,null,null,null,null,null,null,null,null,null,null,null,null,null,null,null,null,null,null,null,null,null,null,{"$f":"IF($AA$1=\"Yes\",IF(OR(ISBLANK(I5),I5=\"Open\"),\"R\",IF(I5=\"Mitigation Plan Approved\",\"Y\",\"G\")),\"\")","v":""}]
[3,"What is the type of furnace used? Look for EAF, BOF, etc.",null,null,null,null,null,null,null,null,null,null,null,null,null,null,null,null,null,null,null,null,null,null,null,null,""]
[4,"Is scrap used in the melting furnace? If yes, what % used is scrap? What are the scrap quality types used? Scrap quality types are type I and type II.",null,null,null,null,null,null,null,null,null,null,null,null,null,null,null,null,null,null,null,null,null,null,null,null,""]
[5,"Is the heat number control in place? Check the process control plan.",null,null,null,null,null,null,null,null,null,null,null,null,null,null,null,null,null,null,null,null,null,null,null,null,""]
[6,"Is secondary melting practiced? Look for VAR or ESR.",null,null,null,null,null,null,null,null,null,null,null,null,null,null,null,null,null,null,null,null,null,null,null,null,""]
[7,"How is one heat of material defined? Look for the total weight.",null,null,null,null,null,null,null,null,null,null,null,null,null,null,null,null,null,null,null,null,null,null,null,null,""]
[8,"Is this material deoxidized? If yes, what is the primary de-oxidizing element(Al or Si)? What oxygen levels(ppm) are typical of this grade? Generally oxygen levels are less than 25 ppm for everyting except for axle bar and gear steel which should be less than 20 ppm and bearings should be less than 12 ppm.",null,null,null,null,null,null,null,null,null,null,null,null,null,null,null,null,null,null,null,null,null,null,null,null,""]
[9,"Is degassing performed for ths material? If yes, what is the degassing type?  What is the degassing time(minutes) and vacuum level(tor)? Look for degassing types of RH, VTD, etc.",null,null,null,null,null,null,null,null,null,null,null,null,null,null,null,null,null,null,null,null,null,null,null,null,""]
[10,"What casting method is used to produce the material? Look for continuous or an ingot process.",null,null,null,null,null,null,null,null,null,null,null,null,null,null,null,null,null,null,null,null,null,null,null,null,""]
[11,"What is the reduction ratio between the as cast size and final size? Should be 8:1 minimum.",null,null,null,null,null,null,null,null,null,null,null,null,null,null,null,null,null,null,null,null,null,null,null,null,""]
[12,"How is the liquid metal protected from the atomsphere during the manufacturing process? Is the ladle to tundish transfer shrouded? If yes, with what? Is the tundish to mold transfer shrouded? If yes, with what? Typical shrouding is a combination of ceramic and gas.",null,null,null,null,null,null,null,null,null,null,null,null,null,null,null,null,null,null,null,null,null,null,null,null,""]
[13,"How are heat numbers segregated when consecutive heats are cast? Look for what length is cut.",null,null,null,null,null,null,null,null,null,null,null,null,null,null,null,null,null,null,null,null,null,null,null,null,""]
[14,"Are any dams, wiers, baffles, stops employed in the tundish? If yes, which ones? Some features should be used in the tundish, if nothing is used need explanation as to why not?",null,null,null,null,null,null,null,null,null,null,null,null,null,null,null,null,null,null,null,null,null,null,null,null,""]
[15,"What is the tundish size (weight) and residence time (seconds or minutes)?",null,null,null,null,null,null,null,null,null,null,null,null,null,null,null,null,null,null,null,null,null,null,null,null,""]
[16,"What is the minimum superheat temperature required between ladle tap temperature and the steel liquidus temperature? Should be controlled such that no additional heat is added after the Ladle Furnace, no reheating at the caster is permitted",null,null,null,null,null,null,null,null,null,null,null,null,null,null,null,null,null,null,null,null,null,null,null,null,""]
[17,"Is mold oscillation practiced? If yes, what is the control method? Control method should be fixed or dynamic control by computer system",null,null,null,null,null,null,null,null,null,null,null,null,null,null,null,null,null,null,null,null,null,null,null,null,""]
[18,"Is electromagnetic stirring practiced? Required to be yes",null,null,null,null,null,null,null,null,null,null,null,null,null,null,null,null,null,null,null,null,null,null,null,null,""]
[19,"How is the casting speed monitored and controlled? Should be computer controlled and monitored.",null,null,null,null,null,null,null,null,null,null,null,null,null,null,null,null,null,null,null,null,null,null,null,null,""]
[20,"How is the solidifying billet/bloom cooled? Should have several sections of water sprays, controls in place to ensure all sprays are on and working as expected",null,null,null,null,null,null,null,null,null,null,null,null,null,null,null,null,null,null,null,null,null,null,null,null,""]
[21,"How is slag entrapment in the cast product prevented? Vortex detection is preferred, other methods are allowed such as UT inspection of finished products or controlling the liquid levels to ensure no vortexing.",null,null,null,null,null,null,null,null,null,null,null,null,null,null,null,null,null,null,null,null,null,null,null,null,""]
[22,"What is the typical Mn:S ratio (Ref. Section 6.2). 30:1 minimum for forgings, higher numbers are preferred.",null,null,null,null,null,null,null,null,null,null,null,null,null,null,null,null,null,null,null,null,null,null,null,null,""]
[23,"What is the grain refining method? And how is it measured? (Ref. Section 6.3). Method can be Aluminum or microalloy (V, Nb, Ti), measured via apparent, McQuaid-Ehn or other austenitic methods.",null,null,null,null,null,null,null,null,null,null,null,null,null,null,null,null,null,null,null,null,null,null,null,null,""]
[24,"If hardenability is required how is it measured? (Ref. Section 6.4). Jominy or calculated",null,null,null,null,null,null,null,null,null,null,null,null,null,null,null,null,null,null,null,null,null,null,null,null,""]
[25,"What are typical macroetch results for this grade? (Ref. Section 6.5). 3S2R2C or better, lower numbers are better results ",null,null,null,null,null,null,null,null,null,null,null,null,null,null,null,null,null,null,null,null,null,null,null,null,""]
[26,"What are the typical microcleanliness results? (Ref. Section 6.5) See tables in 33200011 for expected results, again lower numbers are better.",null,null,null,null,null,null,null,null,null,null,null,null,null,null,null,null,null,null,null,null,null,null,null,null,""]
[27,"How is decarburization controlled? (Ref. Section 6.7) Preferred answer would be control over the reheat furance time and rolling schedule.",null,null,null,null,null,null,null,null,null,null,null,null,null,null,null,null,null,null,null,null,null,null,null,null,""]
[28,"Does your NDT process have the abililty to detect the maximum allowable discontinuity sizes given for this product? (Ref. Section 6.8) If yes, probabilty of detection data for support is preferred.",null,null,null,null,null,null,null,null,null,null,null,null,null,null,null,null,null,null,null,null,null,null,null,null,""]
[29,"What are the detection limits for each NDT method used? (Ref Section 6.8) Example: For ultrasonic: size detectable is 0.4mm x 12.7 mm, for eddy current, depth detectable is 0.25 mm.",null,null,null,null,null,null,null,null,null,null,null,null,null,null,null,null,null,null,null,null,null,null,null,null,""]
[30,"Does this material have a special quality requirement? (Ref Section 7). ",null,null,null,null,null,null,null,null,null,null,null,null,null,null,null,null,null,null,null,null,null,null,null,null,""]
[31,"Are any additional measures being taken to ensure this quality level is met?",null,null,null,null,null,null,null,null,null,null,null,null,null,null,null,null,null,null,null,null,null,null,null,null,""]
["Note: For any non conformances to this survey please request exceptions form X-3484b from the Nexteer AQE.  After filling out the form, submit the completed form to the Nexteer AQE for review and approval."]