{"text_format":"1","workbook":"xlsx","n_sheets":15,"sheets":["Instructions","QSB+ process","Header","Summary NSA","Summary PCPA","Summary QSB+","Summary Original QSB+","Audit","Action Plan","Glossary","Supplier Info Questions","Service","Technology","Price","Master"],"not_rendered":{"charts":0,"images":3,"macros":1,"external_links":4,"defined_names":14,"comments":0,"pivot_tables":0},"unopened":[],"bounds":{"document_bytes":16777216,"sheet_cells":100000,"rows_first":2000,"rows_last":500,"rows_between":2000,"halvings":0,"cell_chars":16384,"cell_head_chars":4096},"cells_cut":0,"cells_raw":0,"read":"whole","date_system":"1900"}

{"sheet":"Instructions","index":0,"n_rows":75,"n_cols":7,"rows_kept":75,"cut":false,"hidden":false,"merged":[[35,2,35,6],[36,2,36,6],[37,2,37,6],[38,2,38,6],[29,0,29,4],[30,0,30,4],[31,0,31,6],[32,0,32,6],[33,2,33,6],[34,2,34,6],[3,2,3,6],[4,3,4,6],[68,2,68,6],[69,2,69,6],[70,2,70,6],[62,2,62,6],[63,2,63,6],[64,2,64,6],[65,2,65,6],[66,2,66,6],[67,2,67,6],[58,0,58,4],[59,0,59,6],[51,3,51,6],[52,3,52,6],[56,2,56,6],[61,2,61,6],[60,0,60,6],[53,3,53,6],[54,3,54,6],[55,3,55,6],[39,0,39,6],[46,3,46,6],[47,3,47,6],[48,3,48,6],[49,2,49,6],[12,2,12,6],[44,3,44,6],[45,3,45,6],[50,3,50,6],[19,2,19,6],[21,2,21,6],[41,3,41,6],[42,3,42,6],[43,3,43,6],[40,2,40,6],[22,0,22,6],[23,3,23,6],[24,3,24,6],[26,3,26,6],[27,3,27,6],[28,3,28,6],[74,1,74,7],[72,0,72,4],[73,1,73,7],[0,2,0,6],[2,0,2,6],[5,2,5,6],[6,3,6,6],[25,3,25,6],[7,2,7,6],[8,3,8,6],[16,2,16,6],[14,2,14,6],[15,2,15,6],[17,2,17,6],[9,0,9,6],[10,0,10,6]]}
[null,null,"Instructions"]
[]
["Quality and Industrial Performance (QIP) audit sheet is a common questionnaire includes 3 types of audit: "]
[null,"1)","NSA     New Supplier Assessment"]
[null,null,null,"Complete system assessment to evaluate potential supplier's manufacturing system.\nNeed to assess supplier readiness for each 'Requirement'. Basic criteria are a guideline, no need to consider additional criteria.\nResult is a risk assessment, affects to sourcing decision."]
[null," 2)","QSB+   Quality Systems Basics Plus "]
[null,null,null,"Complete manufacturing system assessment to focus and verify implementation of QSB+ key elements on shop floor level.\nAll the 'Criteria of Requirement' of questionnaire need to be assessed.\nResult affects to QSB+ certification status and Bidlist performance."]
[null,"3)","PCPA   Process Control Plan Audit"]
{"$rows_left_out":68}
{"sheet":"QSB+ process","index":1,"n_rows":45,"n_cols":7,"rows_kept":45,"cut":false,"hidden":false,"merged":[[42,1,42,5],[44,1,44,5],[36,1,36,5],[26,1,26,5],[28,1,28,5],[30,1,30,5],[32,1,32,5],[38,1,38,5],[13,1,14,5],[15,1,16,5],[18,1,19,5],[20,1,21,5],[22,1,22,5],[11,1,11,5],[0,1,0,5],[2,1,3,5],[4,1,4,5],[6,1,6,5],[8,1,10,5]]}
[null,"Quality Systems Basics Plus"]
[]
[" 1)","The QSB+ is a questionnaire used to provide objective evidence that satisfies both General Motor's and PSA's Supplier Quality Expectations."]
[]
["2)","Supplier is required to read through QSB+ presentation before filling Audit form in, to understand QSB+ expectation. If needed Supplier can contact approved 3rd party providers for QSB+ training or workshop.  "]
[]
["3)","Suppliers are required to keep completed copies of the QSB+, and accompanying corrective action plans, covering the prior 12 months.  "]
[]
{"$rows_left_out":38}
{"sheet":"Header","index":2,"n_rows":36,"n_cols":10,"rows_kept":36,"cut":false,"hidden":false,"merged":[[11,1,11,8],[12,1,12,8],[6,0,6,8],[7,1,7,8],[8,1,8,8],[10,0,10,8],[9,1,9,8],[0,0,0,8],[3,1,3,8],[4,1,4,8],[5,1,5,8],[1,0,1,8],[31,0,34,0],[28,0,29,0],[13,1,13,8],[14,0,14,8],[18,1,18,8],[16,1,16,8],[22,1,22,8],[24,1,24,3],[24,5,24,8],[30,1,30,8],[23,1,23,8],[19,1,19,8],[20,2,20,8],[25,1,25,3],[25,5,25,8]]}
[null,null,null,null,null,null,null,null,null,false]
[null,null,null,null,null,null,null,null,null,false]
["Supplier Site Identification",null,null,null,null,null,null,null,null,false]
["Supplier Name",null,null,null,null,null,null,null,null,false]
["Supplier Location",null,null,null,null,null,null,null,null,false]
["Supplier DUNS / COFOR",null,null,null,null,null,null,null,null,false]
["Supplier Self Assessment",null,null,null,null,null,null,null,null,false]
["Self-Assessment Date",null,null,null,null,null,null,null,null,false]
{"$rows_left_out":29}
{"sheet":"Summary NSA","index":3,"n_rows":35,"n_cols":12,"rows_kept":35,"cut":false,"hidden":true,"merged":[[28,1,30,2],[31,1,33,2],[29,7,29,10],[30,3,30,6],[30,7,30,10],[31,3,31,6],[31,7,31,10],[0,0,0,11],[25,7,25,10],[26,7,26,10],[27,7,27,10],[25,3,25,6],[26,3,26,6],[27,3,27,6],[23,1,23,2],[1,0,1,1],[1,2,1,6],[1,7,1,10],[2,0,2,1],[2,2,2,6],[2,7,2,10],[3,0,3,1],[3,2,3,6],[3,7,3,10],[6,3,6,6],[6,7,6,10],[34,1,34,2],[34,3,34,11],[24,1,24,2],[24,3,24,6],[24,7,24,10],[28,3,28,6],[28,7,28,10],[29,3,29,6],[32,3,32,6],[32,7,32,10],[33,3,33,6],[33,7,33,10],[25,1,27,2]]}
["NSA - New Supplier Assessment"]
["Supplier Name",null,{"$f":"Header!B4","v":0},null,null,null,null,"Scope of Audit",null,null,null,{"$f":"Header!A2","v":0}]
["Supplier Location",null,{"$f":"Header!B5","v":0},null,null,null,null,"Audit Date",null,null,null,{"$f":"Header!B12","v":"00:00:00"}]
["Supplier DUNS / COFOR",null,{"$f":"Header!B6","v":0},null,null,null,null,"Auditor Name",null,null,null,{"$f":"Header!B13","v":0}]
[]
[]
[null,null,null,"Self Assessment Scoring",null,null,null,"Customer Audit Scoring"]
[null,"Key Elements",null,"Potential","Total","%","Status","Potential","Total","%","Status","Comment"]
{"$rows_left_out":28}
{"sheet":"Summary PCPA","index":4,"n_rows":26,"n_cols":12,"rows_kept":26,"cut":false,"hidden":false,"merged":[[0,0,0,11],[25,1,25,2],[25,3,25,11],[24,1,24,2],[24,3,24,6],[24,7,24,10],[23,1,23,2],[1,0,1,1],[1,2,1,6],[1,7,1,10],[2,0,2,1],[2,2,2,6],[2,7,2,10],[3,0,3,1],[3,2,3,6],[3,7,3,10],[6,3,6,6],[6,7,6,10]]}
["PCPA - Process Control Plan Audit"]
["Supplier Name",null,{"$f":"Header!B4","v":0},null,null,null,null,"Scope of Audit",null,null,null,{"$f":"Header!A2","v":0}]
["Supplier Location",null,{"$f":"Header!B5","v":0},null,null,null,null,"Audit Date",null,null,null,{"$f":"Header!B12","v":"00:00:00"}]
["Supplier DUNS / COFOR",null,{"$f":"Header!B6","v":0},null,null,null,null,"Auditor Name",null,null,null,{"$f":"Header!B13","v":0}]
[]
[]
[null,null,null,"Self Assessment Scoring",null,null,null,"Customer Audit Scoring"]
[null,"Key Elements",null,"Potential","Total","%","Status","Potential","Total","%","Status","Comment"]
{"$rows_left_out":19}
{"sheet":"Summary QSB+","index":5,"n_rows":25,"n_cols":16,"rows_kept":25,"cut":false,"hidden":true,"merged":[[24,1,24,2],[23,1,23,2],[23,3,23,15],[21,1,21,2],[6,3,6,6],[22,11,22,14],[22,3,22,6],[6,11,6,14],[0,0,0,15],[22,1,22,2],[6,7,6,10],[22,7,22,10],[1,0,1,2],[2,0,2,2],[3,0,3,2],[4,0,4,2],[4,3,4,15],[1,9,1,13],[2,9,2,13],[3,9,3,13],[1,3,1,8],[2,3,2,8],[3,3,3,8]]}
["QSB+ - Quality Systems Basics +"]
["Supplier Name",null,null,{"$f":"Header!B4","v":0},null,null,null,null,null,"Scope of Audit",null,null,null,null,null,{"$f":"Header!A2","v":0}]
["Supplier Location",null,null,{"$f":"Header!B5","v":0},null,null,null,null,null,"Audit Date",null,null,null,null,null,{"$f":"Header!B12","v":"00:00:00"}]
["Supplier DUNS / COFOR",null,null,{"$f":"Header!B6","v":0},null,null,null,null,null,"Auditor Name",null,null,null,null,null,{"$f":"Header!B13","v":0}]
["Audit Conductor"]
[]
[null,null,null,"Self Assessment Scoring",null,null,null,"Original QSB+",null,null,null,"Customer Audit Scoring"]
[null,"Key Elements",null,"Potential","Total","%","Status","Potential","Total","%","Status","Potential","Total","%","Status","Comment"]
{"$rows_left_out":18}
{"sheet":"Summary Original QSB+","index":6,"n_rows":24,"n_cols":12,"rows_kept":24,"cut":false,"hidden":false,"merged":[[22,1,22,2],[22,3,22,6],[22,7,22,10],[23,1,23,2],[23,3,23,11],[21,1,21,2],[0,0,0,11],[1,0,1,1],[1,2,1,6],[1,7,1,10],[2,0,2,1],[2,2,2,6],[2,7,2,10],[3,0,3,1],[3,2,3,6],[3,7,3,10],[6,3,6,6],[6,7,6,10]]}
["Original / Revised QSB+"]
["Supplier Name",null,{"$f":"Header!B4","v":0},null,null,null,null,"Scope of Audit",null,null,null,{"$f":"Header!A2","v":0}]
["Supplier Location",null,{"$f":"Header!B5","v":0},null,null,null,null,"Audit Date",null,null,null,{"$f":"Header!B12","v":"00:00:00"}]
["Supplier DUNS / COFOR",null,{"$f":"Header!B6","v":0},null,null,null,null,"Auditor Name",null,null,null,{"$f":"Header!B13","v":0}]
[]
[]
[null,null,null,"Original QSB+",null,null,null,"Revised QSB+"]
[null,"Key Elements",null,"Potential","Total","%","Status","Potential","Total","%","Status","Comment"]
{"$rows_left_out":17}
{"sheet":"Audit","index":7,"n_rows":138,"n_cols":13,"rows_kept":138,"cut":false,"hidden":false,"merged":[]}
["Item","Structure","QSB+","PCPA","NSA","Requirement","Criteria of Requirement","Look for","Comment","Supplier score","Original\nQSB+","Current audit score","Revised\nQSB+"]
["Fast Response",1]
["FR1",null,"X",null,"X","Daily leadership meeting held with cross-functional, multilevel attendees to address significant external and internal concerns.","1) There is a daily Fast Response (FR) meeting with cross-functional attendees and led by manufacturing.\n2) The FR meeting is a communication meeting and timing is respected.\n3) All the significant external and internal issues are addressed.\n4) Natural owners are assigned to problems, next report out date is assigned.\n5) Meeting takes into account the production forecast and the quantity produced.\n6) Safety and near miss accident issues are reported out.","Attend on FR meeting. Observe:\n- led by manufacturing with cross -functional attendees,\n-  how leader controls the FR meeting (keep timing max 10-20 minutes, focus on subject, not going to the details...),\n- environment is suitable (everyone can hear and see the meeting),\n- how issues reported out,\n- problem solving report format is used for report out and document the status of the issue."]
["FR2",null,"X",null,null,"Fast Response Board tracks all major concerns with appropriate timing and exit criteria.","1) Fast Response board is used for tracking of issues, being updated before FR meeting (board could be a dry erase board, laminated poster, Excel sheet projected by beamer etc.).\n2) Method of communicating problems to all Key Stake holders  is defined (e.g. Quality Alert, Temporary Work Instructions, By-Pass Procedure etc.).\n3) Exit criteria represent the core 6 Steps of problem solving (1. Define 2. Contain 3. Root cause 4. Correct 5. Validate 6. Institutionalize) including timing for each of the exit criteria.\n4) All the exit criteria are statused (Red, Yellow, Green), red items have a planned date to go green with next steps. Problems are not closed until all criteria is met. Overall status represents the worst condition or overall planned timing has been exceeded.","- Prior to the audit check the last customer complaints focusing to the open ones. \n- Prior to the FR meeting ask if there are any significant internal issues.\n- Check the board if it contains above described external and internal issues.\n- Follow an issue from FR Tracking Board through the exit criteria confirming actions are in place & all the relevant documents have been updated.\n- Check few statuses if they are rated well based on their timing, judge few N/A items whether they do not need to close the issue."]
["FR3",null,"X","X","X","System is in place to ensure fast response to operator's concerns and information flow between shifts.","1) System in place to support respond to the concerns of the operator.\n2) Escalation process is defined in order to ensure that problems are quickly communicated to people who can help.\n3) All information which can affect the next shifts have to be passed across and documented.\n4) Manufacturing leadership  reviews shift book daily to verify proper containment or corrective action done, decides further escalation to FR meeting.","- Ask operators how they can escalate their issues.\n- Andon system or similar in place, if applicable.\n- Test andon's function and response to request (light boards, lamps, or audio signals work, support arrives soon).\n- Participate at shift change, check shift book and information shared."]
["FR4",null,"X","X","X","A defined process for Problem Solving including a standard for documenting the tools used for root cause identification.","1) Standard process (PPSR, 8D or equivalent) used with a format that follows the core \"6 Steps\" of problem solving (1.Define, 2.Contain, 3.Root Cause, 4.Correct, 5.Validate, 6.Institutionalize).\n2) Analysis process is developed and applied for all the customer returned parts. \n3) Problem Solving forms used across the plant for internal, customer and supplier issues. \n4) Evidence of cross-functional team approach for solving problems.\n5) Tools for identifying root cause are applied (7 diamonds, 3X5 why to correct systemic issues, Fishbone Diagram etc.).","- Prior to the audit check last customer complaints focusing to the issues where root cause found and corrective action implemented.\n- Verify that problem solving used efficiently, all the core \"6 steps\" applied, specially that real main root cause found and action implemented against the root cause.\n- If no customer complaint issued verify via an internal or sub-supplier issue.\n- Check a Drill Deep (5 whys), main systematic root causes found."]
["FR5",null,"X","X","X","A system to capture and institutionalize lessons learned.","1) Electronic form or database is used to document Lessons Learned.\n2) Method which assures implementation supported by evidence of review dates, distribution lists, or posted Lessons Learned as well as reviewed by Leadership.\n3) Institutionalization (Read Across) is applied for all the issues where problem solving is done.\n4) Completed Lessons Learned information which is easily retrievable by all who need the information. (e.g. Master FMEA, APQP Program check list reviews).\n5) A process to collect suggestions of personnel is put in place and contribute to Lessons Learned and process improvement.","- Ask people for examples how they are using Lessons Learned system.\n- Check 6th step of problem solving (Institutionalize) via examples of point FR4. Check Drill Wide Matrix or 7&8th step of 8D of last customer complaints."]
["FRE",null,"X",null,null,"Targets are defined and followed to ensure effectiveness of fast reaction for external and internal issues.","1) Tracking of safety related metrics (e.g.: accident without lost working days, distinguishing lost time accident & no lost time accident etc.). Lead time to solve safety issues.\n2) Quality Q or other method to track FR performance is posted and up to date.\n3) Tracking of total amount of significant internal and customer complaints based on their trend and statuses (not responded, open, or in delay and closed in time) and average closing timing.\n4) Tracking of all issues that reoccurred after corrective action has been implemented.\n5) Continuous improvement data for line stoppage/downtime from Andon.\n6) Location with a high level of customer complaints (>24 complaints in last 12 months) shall have a special team created to work on complaints reductions - performance shall be tracked at FR meeting on open issues list.","- Prior to audit check number of last 12 month PRRs. If higher than 24 (do not count line accumulation ones) or trend is significantly negative, special PRR reduction team has to be established.\n- Check last customer complaints whether due dates kept. If not reasons for delay, actions need to be addressed.\n- Check red items percentage, evaluate actions addressed to eliminate roadblocks.\n- Evidence of periodical review of average closing time for each exit criteria and set  action plan for any deviation."]
{"$rows_left_out":131}
{"sheet":"Action Plan","index":8,"n_rows":72,"n_cols":14,"rows_kept":72,"cut":false,"hidden":false,"merged":[[0,0,0,1],[0,2,0,3],[0,4,0,8],[0,9,0,13],[1,0,1,1],[1,2,1,3],[1,4,1,8],[1,9,1,13],[2,0,2,1],[2,2,2,3],[2,4,2,8],[2,9,2,13],[4,1,5,1],[4,7,4,12],[4,13,5,13],[4,0,5,0],[4,2,5,2],[4,3,5,3],[4,4,5,4],[4,5,5,5],[4,6,5,6]]}
["Supplier Name",null,{"$f":"Header!B4","v":0},null,"Scope of Audit",null,null,null,null,{"$f":"Header!A2","v":0}]
["Supplier Location",null,{"$f":"Header!B5","v":0},null,"Audit Date",null,null,null,null,{"$f":"Header!B12","v":"00:00:00"}]
["Supplier DUNS / COFOR",null,{"$f":"Header!B6","v":0},null,"Auditor Name",null,null,null,null,{"$f":"Header!B13","v":0}]
[]
["Item","Non-conformities - Remark description","Action item ","Action leader","Date opened","Target close date","Actual close date","Progress",null,null,null,null,null,"Remarks / Comments"]
[null,null,null,null,null,null,null,1,2,3,4,5,6]
["Fast Response"]
["FR1"]
{"$rows_left_out":65}
{"sheet":"Glossary","index":9,"n_rows":80,"n_cols":2,"rows_kept":80,"cut":false,"hidden":false,"merged":[]}
["Acronym","Definition"]
["5S","Methodology of a workplace organization & continuous improvement"]
["6 sigma","Set of tools & strategies for process improvement"]
["7 Waste","Correction, Overproduction, Motion, Material Movement, Waiting, Inventory, Processing"]
["8D","8 Disciplines of Problem Solving"]
["AIAG","Automotive Industry Action Group"]
["ASN","Advanced Shipping Notice"]
["AVIEXP","Despatch Advice. Message sent through EDI connexion just after shipping"]
{"$rows_left_out":73}
{"sheet":"Supplier Info Questions","index":10,"n_rows":94,"n_cols":13,"rows_kept":94,"cut":false,"hidden":true,"merged":[[89,1,89,5],[93,6,93,12],[29,10,29,12],[28,0,28,12],[30,6,30,8],[80,6,80,9],[59,7,59,12],[74,0,74,12],[76,7,76,12],[78,6,78,9],[88,1,88,5],[88,6,88,12],[30,10,30,12],[33,6,33,7],[34,9,34,12],[56,0,56,12],[24,7,24,8],[25,7,25,8],[26,6,26,8],[29,0,29,4],[29,6,29,8],[21,6,21,8],[21,10,21,12],[22,6,22,8],[22,10,22,12],[23,6,23,8],[20,6,20,8],[20,10,20,12],[13,0,13,2],[13,3,13,4],[13,6,13,8],[13,10,13,12],[14,6,14,8],[15,6,15,8],[16,6,16,8],[17,6,17,8],[19,0,19,4],[19,6,19,8],[19,10,19,12],[11,0,11,2],[11,3,11,4],[11,6,11,8],[11,10,11,12],[12,0,12,2],[12,3,12,4],[12,6,12,8],[12,10,12,12],[9,3,9,4],[9,6,9,8],[9,10,9,12],[10,0,10,2],[10,3,10,4],[10,6,10,8],[10,10,10,12],[0,0,0,12],[81,10,81,12],[82,6,82,7],[83,8,83,12],[2,0,2,12],[3,0,3,2],[3,3,3,4],[3,6,3,8],[3,10,3,12],[5,6,5,8],[5,10,5,12],[6,0,6,2],[6,3,6,4],[6,6,6,8],[6,10,6,12],[7,0,7,2],[86,0,86,12],[4,0,4,2],[4,3,4,4],[4,6,4,8],[4,10,4,12],[5,0,5,2],[5,3,5,4],[58,6,58,12],[7,3,7,4],[7,6,7,8],[7,10,7,12],[8,0,8,2],[8,3,8,4],[8,6,8,8],[8,10,8,12],[9,0,9,2]]}
["New Supplier Assessment (NSA)\nInformation Sheet"]
[]
["PEOPLE / HR"]
["Position",null,null,"Name",null,"Phone Number","Months in Position",null,null,"Years at Company","E-mail Address"]
["CEO / President"]
["QA MANAGER"]
["PLANT MANAGER"]
["PROD. CONTROL"]
{"$rows_left_out":87}
{"sheet":"Service","index":11,"n_rows":91,"n_cols":9,"rows_kept":91,"cut":false,"hidden":true,"merged":[[81,3,84,3],[81,7,84,7],[81,8,84,8],[85,3,88,3],[85,7,88,7],[85,8,88,8],[73,0,76,0],[73,3,76,3],[73,7,76,7],[73,8,76,8],[77,3,80,3],[77,7,80,7],[77,8,80,8],[65,3,68,3],[65,7,68,7],[65,8,68,8],[69,0,71,0],[69,3,72,3],[69,7,72,7],[69,8,72,8],[58,3,60,3],[58,7,60,7],[58,8,60,8],[61,1,64,1],[61,3,64,3],[61,7,64,7],[61,8,64,8],[51,3,54,3],[51,7,54,7],[51,8,54,8],[55,3,57,3],[55,7,57,7],[55,8,57,8],[43,3,46,3],[43,7,46,7],[43,8,46,8],[47,1,50,1],[47,3,50,3],[47,7,50,7],[47,8,50,8],[35,1,38,1],[35,3,38,3],[35,7,38,7],[35,8,38,8],[39,3,42,3],[39,7,42,7],[39,8,42,8],[27,3,30,3],[27,7,30,7],[27,8,30,8],[31,3,33,3],[31,7,34,7],[31,8,34,8],[19,1,22,1],[19,3,22,3],[19,7,22,7],[19,8,22,8],[23,3,26,3],[23,7,26,7],[23,8,26,8],[11,3,14,3],[11,7,14,7],[11,8,14,8],[15,3,18,3],[15,7,18,7],[15,8,18,8],[7,3,10,3],[7,7,10,7],[7,8,10,8],[1,0,1,3],[3,1,6,1],[3,3,6,3],[3,7,6,7],[3,8,6,8]]}
["New Supplier Assessment (NSA)"]
["Service"]
["Category","Sub-Category","Item","Risk ","Risk Rating Guideline","Choice","Score","Threshold","Comments"]
["Management","Plant Utilization",1,"How long has the supplier been in the business that they are quoting?",null,1,{"$f":"IF(F4=1,0,IF(F4=2,3, 5))","v":0},5]
[]
[]
[]
[null,null,2,"Does supplier/facility currently provide OEM automotive parts?  ",null,1,{"$f":"IF(F8=1,0,IF(F8=2,3, 5))","v":0},3]
{"$rows_left_out":84}
{"sheet":"Technology","index":12,"n_rows":92,"n_cols":9,"rows_kept":92,"cut":false,"hidden":true,"merged":[[82,3,85,3],[82,7,85,7],[82,8,85,8],[86,0,88,0],[86,1,89,1],[86,3,89,3],[86,7,89,7],[86,8,89,8],[74,1,77,1],[74,3,77,3],[74,7,77,7],[74,8,77,8],[78,1,81,1],[78,3,81,3],[78,7,81,7],[78,8,81,8],[66,3,69,3],[66,7,69,7],[66,8,69,8],[70,3,73,3],[70,7,73,7],[70,8,73,8],[58,3,61,3],[58,7,61,7],[58,8,61,8],[62,1,65,1],[62,3,65,3],[62,7,65,7],[62,8,65,8],[50,3,53,3],[50,7,53,7],[50,8,53,8],[54,3,57,3],[54,7,57,7],[54,8,57,8],[42,3,45,3],[42,7,45,7],[42,8,45,8],[46,3,49,3],[46,7,49,7],[46,8,49,8],[34,3,36,3],[34,7,37,7],[34,8,37,8],[38,3,41,3],[38,7,41,7],[38,8,41,8],[26,3,28,3],[26,7,29,7],[26,8,29,8],[30,3,31,3],[30,7,33,7],[30,8,33,8],[18,3,20,3],[18,7,21,7],[18,8,21,8],[22,3,23,3],[22,7,25,7],[22,8,25,8],[10,3,12,3],[10,7,13,7],[10,8,13,8],[14,1,16,1],[14,3,15,3],[14,7,17,7],[14,8,17,8],[6,3,7,3],[6,7,9,7],[6,8,9,8],[1,0,1,3],[3,1,5,1],[3,3,4,3],[3,7,5,7],[3,8,5,8]]}
["New Supplier Assessment (NSA)"]
["Technology"]
["Category","Sub-Category","Item","Risk ","Risk Rating Guideline","Choice","Score","Threshold","Comments"]
["Engineering","Engineering Support",1,"Engineering in sourcing region.",null,1,{"$f":"IF(F4=1,0,IF(F4=2,5,7))","v":0},7]
[]
[]
[null,null,2,"Location of engineering different than manufacturing?",null,1,{"$f":"IF(F7=1,0,IF(F7=2,3))","v":0},3]
[]
{"$rows_left_out":85}
{"sheet":"Price","index":13,"n_rows":82,"n_cols":9,"rows_kept":82,"cut":false,"hidden":true,"merged":[[95,3,98,3],[99,3,102,3],[70,3,74,3],[73,1,76,1],[75,3,78,3],[79,3,82,3],[83,3,86,3],[84,1,87,1],[87,3,90,3],[89,1,92,1],[91,3,94,3],[94,1,97,1],[66,3,69,3],[53,1,54,1],[53,3,54,3],[53,7,54,7],[53,8,54,8],[56,1,57,1],[56,3,58,3],[56,7,57,7],[56,8,57,8],[59,1,60,1],[59,3,60,3],[59,7,60,7],[59,8,60,8],[62,3,65,3],[43,0,44,0],[46,3,49,3],[46,7,49,7],[46,8,49,8],[50,1,51,1],[50,3,51,3],[50,7,51,7],[50,8,51,8],[37,1,40,1],[38,3,41,3],[38,7,41,7],[38,8,41,8],[42,1,45,1],[42,3,45,3],[42,7,45,7],[42,8,45,8],[30,3,33,3],[30,7,33,7],[30,8,33,8],[34,3,37,3],[34,7,37,7],[34,8,37,8],[23,1,26,1],[23,3,24,3],[23,7,25,7],[23,8,25,8],[26,3,29,3],[26,7,29,7],[15,3,18,3],[15,7,18,7],[15,8,18,8],[19,3,22,3],[19,7,22,7],[19,8,22,8],[12,3,14,3],[12,7,14,7],[12,8,14,8],[1,0,1,3],[3,0,4,0],[3,1,5,1],[3,3,5,3],[3,7,5,7],[3,8,5,8],[9,0,10,0],[9,1,10,1],[9,3,10,3],[9,7,10,7],[9,8,10,8]]}
["New Supplier Assessment (NSA)"]
["Price"]
["Category","Sub-Category","Item","Risk ","Risk Rating Guideline","Choice","Score","Threshold","Comments"]
["Company Ownership","In regard to the Company Profile:  ",1,"Is the company privately held?",null,2,{"$f":"IF(F4=1,5,0)","v":0},5]
[]
[]
[null,null,2,"Are there relevant business arrangements with other suppliers?  (JV, Alliance Partners, Co-Development, Shared Patents, etc)?",null,1,{"$f":"IF(F7=1,0,IF(F7=2,1,IF(F7=3,5,7)))","v":0},5]
[null,null,3,"Is the company unionized? ",null,1,{"$f":"IF(F8=1,0,IF(F8=2,1,5))","v":0},1]
{"$rows_left_out":75}
{"sheet":"Master","index":14,"n_rows":160,"n_cols":12,"rows_kept":160,"cut":false,"hidden":true,"merged":[]}
[1,null,"QSB+","Raw\nOriginal QSB+","Raw\nCurrent Audit","Raw\nRevised QSB+","Original QSB+","Current Audit","Revised QSB+ ","New QSB+\nData","Original QSB+\n(copy/paste)","Original QSB+\nData"]
[2,{"$f":"IF(Audit!A2<>\"\",Audit!A2,\"\")","v":"Fast Response"},{"$f":"IF(Audit!C2<>\"\",Audit!C2,\"\")","v":""},{"$f":"IF(Audit!K2<>\"\",Audit!K2,\"\")","v":""},{"$f":"IF(Audit!L2<>\"\",Audit!L2,\"\")","v":""},{"$f":"IF(Audit!M2<>\"\",Audit!M2,\"\")","v":""},{"$f":"IFERROR(D2,\"\")","v":""},{"$f":"IFERROR(E2,\"\")","v":""},{"$f":"IFERROR(F2,\"\")","v":""},{"$f":"IF($B$1=\"QSB\",IF(AND(H2<>\"\",H2<>\"NR\"),H2,IF(G2<>\"\",G2,\"\")),IF(AND(I2<>\"\",I2<>\"NR\"),I2,IF(K2<>\"\",K2,\"\")))","v":""},null,{"$f":"IF(G2<>\"\",G2,IF(K2<>\"\",K2,\"\"))","v":""}]
[3,{"$f":"IF(Audit!A3<>\"\",Audit!A3,\"\")","v":"FR1"},{"$f":"IF(Audit!C3<>\"\",Audit!C3,\"\")","v":"X"},{"$f":"IF(Audit!K3<>\"\",Audit!K3,\"\")","v":""},{"$f":"IF(Audit!L3<>\"\",Audit!L3,\"\")","v":""},{"$f":"IF(Audit!M3<>\"\",Audit!M3,\"\")","v":""},{"$f":"IFERROR(D3,\"\")","v":""},{"$f":"IFERROR(E3,\"\")","v":""},{"$f":"IFERROR(F3,\"\")","v":""},{"$f":"IF($B$1=\"QSB\",IF(AND(H3<>\"\",H3<>\"NR\"),H3,IF(G3<>\"\",G3,\"\")),IF(AND(I3<>\"\",I3<>\"NR\"),I3,IF(K3<>\"\",K3,\"\")))","v":""},null,{"$f":"IF(G3<>\"\",G3,IF(K3<>\"\",K3,\"\"))","v":""}]
[4,{"$f":"IF(Audit!A4<>\"\",Audit!A4,\"\")","v":"FR2"},{"$f":"IF(Audit!C4<>\"\",Audit!C4,\"\")","v":"X"},{"$f":"IF(Audit!K4<>\"\",Audit!K4,\"\")","v":""},{"$f":"IF(Audit!L4<>\"\",Audit!L4,\"\")","v":""},{"$f":"IF(Audit!M4<>\"\",Audit!M4,\"\")","v":""},{"$f":"IFERROR(D4,\"\")","v":""},"","","",null,""]
[5,{"$f":"IF(Audit!A5<>\"\",Audit!A5,\"\")","v":"FR3"},{"$f":"IF(Audit!C5<>\"\",Audit!C5,\"\")","v":"X"},{"$f":"IF(Audit!K5<>\"\",Audit!K5,\"\")","v":""},{"$f":"IF(Audit!L5<>\"\",Audit!L5,\"\")","v":""},{"$f":"IF(Audit!M5<>\"\",Audit!M5,\"\")","v":""},"","","","",null,""]
[6,{"$f":"IF(Audit!A6<>\"\",Audit!A6,\"\")","v":"FR4"},{"$f":"IF(Audit!C6<>\"\",Audit!C6,\"\")","v":"X"},{"$f":"IF(Audit!K6<>\"\",Audit!K6,\"\")","v":""},{"$f":"IF(Audit!L6<>\"\",Audit!L6,\"\")","v":""},{"$f":"IF(Audit!M6<>\"\",Audit!M6,\"\")","v":""},"","","","",null,""]
[7,{"$f":"IF(Audit!A7<>\"\",Audit!A7,\"\")","v":"FR5"},{"$f":"IF(Audit!C7<>\"\",Audit!C7,\"\")","v":"X"},{"$f":"IF(Audit!K7<>\"\",Audit!K7,\"\")","v":""},{"$f":"IF(Audit!L7<>\"\",Audit!L7,\"\")","v":""},{"$f":"IF(Audit!M7<>\"\",Audit!M7,\"\")","v":""},"","","","",null,""]
[8,{"$f":"IF(Audit!A8<>\"\",Audit!A8,\"\")","v":"FRE"},{"$f":"IF(Audit!C8<>\"\",Audit!C8,\"\")","v":"X"},{"$f":"IF(Audit!K8<>\"\",Audit!K8,\"\")","v":""},{"$f":"IF(Audit!L8<>\"\",Audit!L8,\"\")","v":""},{"$f":"IF(Audit!M8<>\"\",Audit!M8,\"\")","v":""},"","","","",null,""]
{"$rows_left_out":152}