{"text_format":"1","workbook":"xlsx","n_sheets":4,"sheets":["Vertical_Cost_Break_Down","Tooling Cost Breakdown","Definitions","Currency Conversions"],"not_rendered":{"charts":1,"images":2,"macros":1,"external_links":7,"defined_names":1820,"comments":1,"pivot_tables":0},"unopened":[],"bounds":{"document_bytes":16777216,"sheet_cells":100000,"rows_first":2000,"rows_last":500,"rows_between":2000,"halvings":0,"cell_chars":16384,"cell_head_chars":4096},"cells_cut":0,"cells_raw":0,"read":"whole","date_system":"1900"}

{"sheet":"Vertical_Cost_Break_Down","index":0,"n_rows":1096,"n_cols":44,"rows_kept":1096,"cut":false,"hidden":false,"merged":[[831,3,845,3],[852,3,866,3],[679,3,683,3],[663,3,677,3],[684,3,698,3],[581,4,581,6],[602,4,602,6],[644,4,644,6],[665,4,665,6],[847,3,851,3],[784,4,784,6],[785,4,785,6],[786,4,786,6],[781,4,781,6],[782,4,782,6],[787,4,787,6],[759,4,759,6],[863,4,863,6],[864,4,864,6],[853,4,853,6],[855,4,855,6],[858,4,858,6],[776,4,776,6],[774,4,774,6],[532,3,536,3],[511,3,515,3],[490,3,494,3],[516,3,530,3],[758,4,758,6],[755,4,755,6],[756,4,756,6],[735,4,735,6],[734,4,734,6],[737,4,737,6],[754,4,754,6],[750,4,750,6],[745,4,745,6],[742,4,742,6],[739,4,739,6],[700,3,704,3],[736,4,736,6],[692,4,692,6],[740,4,740,6],[713,4,713,6],[618,4,618,6],[619,4,619,6],[620,4,620,6],[627,4,627,6],[668,4,668,6],[738,4,738,6],[711,4,711,6],[721,4,721,6],[727,4,727,6],[729,4,729,6],[522,4,522,6],[438,4,438,6],[439,4,439,6],[616,4,616,6],[605,4,605,6],[701,4,701,6],[717,4,717,6],[722,4,722,6],[695,4,695,6],[696,4,696,6],[686,4,686,6],[706,4,706,6],[700,4,700,6],[703,4,703,6],[716,4,716,6],[450,4,450,6],[451,4,451,6],[470,4,470,6],[423,3,431,3],[423,4,423,6],[424,4,424,6],[425,4,425,6],[426,4,426,6],[427,4,427,6],[428,4,428,6],[429,4,429,6],[410,4,410,6],[411,4,411,6],[413,3,421,3],[413,4,413,6],[414,4,414,6],[415,4,415,6],[416,4,416,6],[417,4,417,6],[418,4,418,6],[419,4,419,6],[403,3,411,3],[403,4,403,6],[404,4,404,6],[405,4,405,6],[406,4,406,6],[407,4,407,6],[383,3,391,3],[383,4,383,6],[384,4,384,6],[385,4,385,6],[386,4,386,6],[387,4,387,6],[408,4,408,6],[409,4,409,6],[390,4,390,6],[391,4,391,6],[393,3,401,3],[393,4,393,6],[394,4,394,6],[395,4,395,6],[396,4,396,6],[397,4,397,6],[398,4,398,6],[399,4,399,6],[373,3,381,3],[368,4,368,6],[369,4,369,6],[373,4,373,6],[374,4,374,6],[375,4,375,6],[376,4,376,6],[377,4,377,6],[380,4,380,6],[381,4,381,6],[379,4,379,6],[353,3,361,3],[353,4,353,6],[354,4,354,6],[355,4,355,6],[356,4,356,6],[357,4,357,6],[358,4,358,6],[359,4,359,6],[433,3,441,3],[433,4,433,6],[434,4,434,6],[435,4,435,6],[436,4,436,6],[388,4,388,6],[389,4,389,6],[440,4,440,6],[441,4,441,6],[360,4,360,6],[361,4,361,6],[363,3,371,3],[363,4,363,6],[364,4,364,6],[365,4,365,6],[366,4,366,6],[343,3,351,3],[343,4,343,6],[344,4,344,6],[345,4,345,6],[346,4,346,6],[347,4,347,6],[348,4,348,6],[349,4,349,6],[350,4,350,6],[351,4,351,6],[333,3,341,3],[333,4,333,6],[334,4,334,6],[335,4,335,6],[336,4,336,6],[337,4,337,6],[338,4,338,6],[339,4,339,6],[340,4,340,6],[341,4,341,6],[323,3,331,3],[323,4,323,6],[324,4,324,6],[325,4,325,6],[326,4,326,6],[327,4,327,6],[305,4,305,6],[306,4,306,6],[307,4,307,6],[328,4,328,6],[329,4,329,6],[310,4,310,6],[311,4,311,6],[313,3,321,3],[313,4,313,6],[314,4,314,6],[315,4,315,6],[316,4,316,6],[317,4,317,6],[330,4,330,6],[331,4,331,6],[268,4,268,6],[264,4,264,6],[265,4,265,6],[46,4,46,6],[49,4,49,6],[911,3,911,6],[269,4,269,6],[270,4,270,6],[277,4,277,6],[278,4,278,6],[279,4,279,6],[280,4,280,6],[902,4,902,6],[293,4,293,6],[294,4,294,6],[295,4,295,6],[296,4,296,6],[297,4,297,6],[298,4,298,6],[299,4,299,6],[318,4,318,6],[319,4,319,6],[320,4,320,6],[321,4,321,6],[237,4,237,6],[238,4,238,6],[233,4,233,6],[234,4,234,6],[235,4,235,6],[236,4,236,6],[230,4,230,6],[260,4,260,6],[267,4,267,6],[254,4,254,6],[255,4,255,6],[261,4,261,6],[231,4,231,6],[217,4,217,6],[218,4,218,6],[204,4,204,6],[206,4,206,6],[219,4,219,6],[220,4,220,6],[214,4,214,6],[215,4,215,6],[211,4,211,6],[213,4,213,6],[209,4,209,6],[905,4,905,6],[871,4,871,6],[870,4,870,6],[872,4,872,6],[890,3,890,6],[878,3,888,3],[899,3,900,3],[899,4,899,6],[900,4,900,6],[892,3,892,6],[903,4,903,6],[904,4,904,6],[894,3,894,6],[895,3,895,6],[896,3,896,6],[891,3,891,6],[877,3,877,6],[893,3,893,6],[887,4,887,6],[883,4,883,6],[886,4,886,6],[823,4,823,6],[824,4,824,6],[809,4,809,6],[845,4,845,6],[848,4,848,6],[816,4,816,6],[850,4,850,6],[830,4,830,6],[818,4,818,6],[817,4,817,6],[821,4,821,6],[822,4,822,6],[842,4,842,6],[843,4,843,6],[831,4,831,6],[834,4,834,6],[811,4,811,6],[815,4,815,6],[849,4,849,6],[847,4,847,6],[832,4,832,6],[826,4,826,6],[851,4,851,6],[779,4,779,6],[780,4,780,6],[800,4,800,6],[801,4,801,6],[865,4,865,6],[813,4,813,6],[799,4,799,6],[868,4,868,6],[839,4,839,6],[862,4,862,6],[866,4,866,6],[840,4,840,6],[841,4,841,6],[852,4,852,6],[857,4,857,6],[810,4,810,6],[803,4,803,6],[797,4,797,6],[798,4,798,6],[814,4,814,6],[808,4,808,6],[829,4,829,6],[844,4,844,6],[8,5,8,6],[9,5,9,6],[10,5,10,6],[44,4,44,6],[43,4,43,6],[40,4,40,6],[41,4,41,6],[42,4,42,6],[918,3,918,6],[897,3,897,6],[916,3,916,6],[913,3,913,6],[902,3,908,3],[906,4,906,6],[907,4,907,6],[908,4,908,6],[856,4,856,6],[874,4,874,6],[861,4,861,6],[859,4,859,6],[876,4,876,5],[860,4,860,6],[778,4,778,6],[773,4,773,6],[57,3,68,3],[96,3,107,3],[109,3,120,3],[63,4,63,6],[75,4,75,6],[60,4,60,6],[61,4,61,6],[68,4,68,6],[83,4,83,6],[70,3,81,3],[83,3,94,3],[107,4,107,6],[113,4,113,6],[112,4,112,6],[110,4,110,6],[96,4,96,6],[94,4,94,6],[90,4,90,6],[118,4,118,6],[119,4,119,6],[103,4,103,6],[104,4,104,6],[105,4,105,6],[106,4,106,6],[769,4,769,6],[771,4,771,6],[772,4,772,6],[760,4,760,6],[766,4,766,6],[698,4,698,6],[705,4,705,6],[601,4,601,6],[767,4,767,6],[761,4,761,6],[710,4,710,6],[704,4,704,6],[763,4,763,6],[768,4,768,6],[751,4,751,6],[748,4,748,6],[746,4,746,6],[747,4,747,6],[757,4,757,6],[764,4,764,6],[611,4,611,6],[612,4,612,6],[643,4,643,6],[606,4,606,6],[481,4,481,6],[478,4,478,6],[544,4,544,6],[543,4,543,6],[538,4,538,6],[473,4,473,6],[367,4,367,6],[378,4,378,6],[370,4,370,6],[371,4,371,6],[400,4,400,6],[401,4,401,6],[430,4,430,6],[431,4,431,6],[420,4,420,6],[421,4,421,6],[437,4,437,6],[527,4,527,6],[537,4,537,6],[535,4,535,6],[547,4,547,6],[539,4,539,6],[505,4,505,6],[512,4,512,6],[509,4,509,6],[491,4,491,6],[510,4,510,6],[493,4,493,6],[495,4,495,6],[498,4,498,6],[582,4,582,6],[541,4,541,6],[551,4,551,6],[480,4,480,6],[483,4,483,6],[484,4,484,6],[488,4,488,6],[575,4,575,6],[293,3,301,3],[574,3,578,3],[453,3,467,3],[476,4,476,6],[474,3,488,3],[497,4,497,6],[495,3,509,3],[557,4,557,6],[563,4,563,6],[568,4,568,6],[528,4,528,6],[464,4,464,6],[465,4,465,6],[486,4,486,6],[455,4,455,6],[565,4,565,6],[273,3,281,3],[300,4,300,6],[301,4,301,6],[303,3,311,3],[303,4,303,6],[273,4,273,6],[274,4,274,6],[304,4,304,6],[291,4,291,6],[283,4,283,6],[284,4,284,6],[285,4,285,6],[286,4,286,6],[287,4,287,6],[308,4,308,6],[309,4,309,6],[122,3,133,3],[263,3,271,3],[85,4,85,6],[221,4,221,6],[125,4,125,6],[126,4,126,6],[135,3,146,3],[135,4,135,6],[140,4,140,6],[128,4,128,6],[266,4,266,6],[170,4,170,6],[158,4,158,6],[155,4,155,6],[199,4,199,6],[200,4,200,6],[207,4,207,6],[208,4,208,6],[205,4,205,6],[201,4,201,6],[195,4,195,6],[193,4,193,6],[172,4,172,6],[168,4,168,6],[662,4,662,6],[651,4,651,6],[648,4,648,6],[708,4,708,6],[676,4,676,6],[677,4,677,6],[674,4,674,6],[675,4,675,6],[673,4,673,6],[679,4,679,6],[687,4,687,6],[683,4,683,6],[682,4,682,6],[685,4,685,6],[694,4,694,6],[697,4,697,6],[688,4,688,6],[689,4,689,6],[690,4,690,6],[660,4,660,6],[654,4,654,6],[667,4,667,6],[669,4,669,6],[693,4,693,6],[635,4,635,6],[629,4,629,6],[630,4,630,6],[631,4,631,6],[641,4,641,6],[637,4,637,6],[646,4,646,6],[650,4,650,6],[645,4,645,6],[632,4,632,6],[633,4,633,6],[642,4,642,6],[639,4,639,6],[585,4,585,6],[584,4,584,6],[583,4,583,6],[730,4,730,6],[702,4,702,6],[733,4,733,6],[670,4,670,6],[671,4,671,6],[672,4,672,6],[709,4,709,6],[719,4,719,6],[714,4,714,6],[715,4,715,6],[680,4,680,6],[681,4,681,6],[628,4,628,6],[663,4,663,6],[634,4,634,6],[625,4,625,6],[622,4,622,6],[653,4,653,6],[647,4,647,6],[664,4,664,6],[666,4,666,6],[626,4,626,6],[469,3,473,3],[469,4,469,6],[216,4,216,6],[133,4,133,6],[443,4,443,6],[448,3,452,3],[58,4,58,6],[89,4,89,6],[88,4,88,6],[84,4,84,6],[251,4,251,6],[452,4,452,6],[245,4,245,6],[246,4,246,6],[449,4,449,6],[448,4,448,6],[143,4,143,6],[144,4,144,6],[145,4,145,6],[137,4,137,6],[124,4,124,6],[148,3,159,3],[596,4,596,6],[47,4,47,6],[51,4,51,6],[50,4,50,6],[74,4,74,6],[71,4,71,6],[48,4,48,6],[57,4,57,6],[59,4,59,6],[53,4,53,6],[55,4,55,6],[52,4,52,6],[65,4,65,6],[64,4,64,6],[70,4,70,6],[66,4,66,6],[127,4,127,6],[141,4,141,6],[100,4,100,6],[101,4,101,6],[115,4,115,6],[79,4,79,6],[151,4,151,6],[152,4,152,6],[148,4,148,6],[149,4,149,6],[116,4,116,6],[117,4,117,6],[131,4,131,6],[136,4,136,6],[138,4,138,6],[122,4,122,6],[123,4,123,6],[129,4,129,6],[146,4,146,6],[142,4,142,6],[150,4,150,6],[111,4,111,6],[87,4,87,6],[169,4,169,6],[139,4,139,6],[130,4,130,6],[132,4,132,6],[256,4,256,6],[178,4,178,6],[179,4,179,6],[180,4,180,6],[203,4,203,6],[191,4,191,6],[153,4,153,6],[154,4,154,6],[159,4,159,6],[156,4,156,6],[157,4,157,6],[161,4,161,6],[162,4,162,6],[164,4,164,6],[165,4,165,6],[166,4,166,6],[223,4,223,6],[177,4,177,6],[182,4,182,6],[210,4,210,6],[194,4,194,6],[176,4,176,6],[161,3,172,3],[174,3,185,3],[227,4,227,6],[228,4,228,6],[229,4,229,6],[223,3,231,3],[183,4,183,6],[184,4,184,6],[193,3,201,3],[197,4,197,6],[185,4,185,6],[224,4,224,6],[225,4,225,6],[226,4,226,6],[198,4,198,6],[203,3,211,3],[213,3,221,3],[174,4,174,6],[175,4,175,6],[163,4,163,6],[171,4,171,6],[181,4,181,6],[243,3,251,3],[288,4,288,6],[289,4,289,6],[290,4,290,6],[271,4,271,6],[263,4,263,6],[239,4,239,6],[240,4,240,6],[247,4,247,6],[248,4,248,6],[249,4,249,6],[250,4,250,6],[244,4,244,6],[243,4,243,6],[241,4,241,6],[257,4,257,6],[258,4,258,6],[259,4,259,6],[253,3,261,3],[253,4,253,6],[276,4,276,6],[281,4,281,6],[233,3,241,3],[283,3,291,3],[7,5,7,6],[97,4,97,6],[120,4,120,6],[114,4,114,6],[109,4,109,6],[534,4,534,6],[492,4,492,6],[453,4,453,6],[482,4,482,6],[472,4,472,6],[457,4,457,6],[462,4,462,6],[471,4,471,6],[477,4,477,6],[467,4,467,6],[458,4,458,6],[460,4,460,6],[459,4,459,6],[466,4,466,6],[461,4,461,6],[463,4,463,6],[98,4,98,6],[446,4,446,5],[196,4,196,6],[45,4,45,6],[76,4,76,6],[99,4,99,6],[62,4,62,6],[73,4,73,6],[559,4,559,6],[561,4,561,6],[487,4,487,6],[490,4,490,6],[501,4,501,6],[556,4,556,6],[503,4,503,6],[508,4,508,6],[506,4,506,6],[536,4,536,6],[529,4,529,6],[526,4,526,6],[553,4,553,6],[540,4,540,6],[545,4,545,6],[550,4,550,6],[454,4,454,6],[275,4,275,6],[188,4,188,6],[790,4,790,6],[726,4,726,6],[752,4,752,6],[753,4,753,6],[806,4,806,6],[807,4,807,6],[802,4,802,6],[838,4,838,6],[794,4,794,6],[795,4,795,6],[789,4,789,6],[793,4,793,6],[805,4,805,6],[827,4,827,6],[828,4,828,6],[837,4,837,6],[835,4,835,6],[836,4,836,6],[833,4,833,6],[788,4,788,6],[765,4,765,6],[820,4,820,6],[819,4,819,6],[775,4,775,6],[616,3,620,3],[658,3,662,3],[963,0,976,2],[705,3,719,3],[726,3,740,3],[747,3,761,3],[768,3,782,3],[789,3,803,3],[810,3,824,3],[917,3,917,6],[910,3,910,6],[914,3,914,6],[912,3,912,6],[915,3,915,6],[649,4,649,6],[652,4,652,6],[655,4,655,6],[656,4,656,6],[661,4,661,6],[721,3,725,3],[743,4,743,6],[744,4,744,6],[742,3,746,3],[638,4,638,6],[989,0,1002,2],[102,4,102,6],[167,4,167,6],[553,3,557,3],[564,4,564,6],[599,4,599,6],[792,4,792,6],[784,3,788,3],[805,3,809,3],[763,3,767,3],[826,3,830,3],[595,3,599,3],[684,4,684,6],[724,4,724,6],[723,4,723,6],[796,4,796,6],[888,4,888,6],[884,4,884,6],[882,4,882,6],[885,4,885,6],[570,4,570,6],[590,4,590,6],[554,4,554,6],[530,4,530,6],[77,4,77,6],[91,4,91,6],[92,4,92,6],[93,4,93,6],[81,4,81,6],[72,4,72,6],[78,4,78,6],[86,4,86,6],[67,4,67,6],[80,4,80,6],[617,4,617,6],[607,4,607,6],[621,4,621,6],[609,4,609,6],[623,4,623,6],[577,4,577,6],[579,4,579,6],[580,4,580,6],[573,4,573,6],[578,4,578,6],[574,4,574,6],[576,4,576,6],[614,4,614,6],[588,4,588,6],[589,4,589,6],[591,4,591,6],[598,4,598,6],[604,4,604,6],[600,4,600,6],[597,4,597,6],[592,4,592,6],[603,4,603,6],[593,4,593,6],[595,4,595,6],[854,4,854,6],[479,4,479,6],[707,4,707,6],[728,4,728,6],[749,4,749,6],[770,4,770,6],[791,4,791,6],[812,4,812,6],[524,4,524,6],[525,4,525,6],[494,4,494,6],[518,4,518,6],[725,4,725,6],[691,4,691,6],[712,4,712,6],[731,4,731,6],[732,4,732,6],[640,4,640,6],[624,4,624,6],[586,4,586,6],[608,4,608,6],[587,4,587,6],[777,4,777,6],[485,4,485,6],[566,4,566,6],[572,4,572,6],[562,4,562,6],[571,4,571,6],[474,4,474,6],[456,4,456,6],[496,4,496,6],[499,4,499,6],[500,4,500,6],[504,4,504,6],[502,4,502,6],[519,4,519,6],[520,4,520,6],[511,4,511,6],[516,4,516,6],[517,4,517,6],[514,4,514,6],[515,4,515,6],[521,4,521,6],[513,4,513,6],[532,4,532,6],[475,4,475,6],[533,4,533,6],[552,4,552,6],[537,3,551,3],[558,3,572,3],[579,3,593,3],[600,3,614,3],[621,3,635,3],[642,3,656,3],[489,4,489,6],[718,4,718,6],[507,4,507,6],[569,4,569,6],[523,4,523,6],[567,4,567,6],[546,4,546,6],[542,4,542,6],[558,4,558,6],[555,4,555,6],[548,4,548,6],[549,4,549,6],[560,4,560,6],[658,4,658,6],[659,4,659,6],[610,4,610,6],[613,4,613,6],[637,3,641,3]]}
[]
[]
[null,null,null,null,null,null,null,null,"Vertical Cost Break Down"]
[null,null,null,null,null,null,null,null,null,null,null,null,null,null,null,null,"Version 2.17"]
[null,null,null,null,null,null,null,"Author","Document #","Date"]
[]
[]
[null,null,null,null,null,"FOREX  INFORMATION"]
[null,null,null,"Graph X-Axis Label Selection",null,"Supplier Local Currency"]
[null,null,null,"Supplier",null,"Customer Paid Currency:"]
[null,null,null,null,null,"Exchange Rate",null,{"$f":"IFERROR(VLOOKUP(H9&\"-\"&H10,'Currency Conversions'!$A:$D,4,FALSE),\"\")","v":""},{"$f":"IFERROR(VLOOKUP(I9&\"-\"&I10,'Currency Conversions'!$A:$D,4,FALSE),\"\")","v":""},{"$f":"IFERROR(VLOOKUP(J9&\"-\"&J10,'Currency Conversions'!$A:$D,4,FALSE),\"\")","v":""},{"$f":"IFERROR(VLOOKUP(K9&\"-\"&K10,'Currency Conversions'!$A:$D,4,FALSE),\"\")","v":""},{"$f":"IFERROR(VLOOKUP(L9&\"-\"&L10,'Currency Conversions'!$A:$D,4,FALSE),\"\")","v":""},{"$f":"IFERROR(VLOOKUP(M9&\"-\"&M10,'Currency Conversions'!$A:$D,4,FALSE),\"\")","v":""},{"$f":"IFERROR(VLOOKUP(N9&\"-\"&N10,'Currency Conversions'!$A:$D,4,FALSE),\"\")","v":""},{"$f":"IFERROR(VLOOKUP(O9&\"-\"&O10,'Currency Conversions'!$A:$D,4,FALSE),\"\")","v":""},{"$f":"IFERROR(VLOOKUP(P9&\"-\"&P10,'Currency Conversions'!$A:$D,4,FALSE),\"\")","v":""},{"$f":"IFERROR(VLOOKUP(Q9&\"-\"&Q10,'Currency Conversions'!$A:$D,4,FALSE),\"\")","v":""}]
[null,null,null,"Cost Driver Graphs"]
[]
[]
[]
[]
[]
[]
[]
[]
[]
[]
[]
[]
[]
[]
[]
[]
[]
[]
{"$rows_left_out":1067}
{"sheet":"Tooling Cost Breakdown","index":1,"n_rows":54,"n_cols":40,"rows_kept":54,"cut":false,"hidden":false,"merged":[[51,24,51,25],[52,3,52,14],[52,16,52,19],[52,23,52,25],[53,3,53,6],[53,7,53,8],[53,9,53,11],[53,13,53,14],[53,17,53,19],[53,24,53,25],[46,3,46,6],[48,7,48,11],[48,12,48,14],[48,16,48,19],[48,23,48,25],[49,3,49,6],[49,7,49,8],[49,9,49,11],[49,13,49,14],[49,15,53,15],[49,17,49,19],[49,20,53,22],[49,24,49,25],[50,3,50,6],[50,7,50,8],[50,9,50,11],[50,13,50,14],[50,17,50,19],[50,24,50,25],[51,3,51,6],[51,7,51,8],[51,9,51,11],[51,13,51,14],[51,17,51,19],[42,8,42,9],[42,12,42,13],[42,15,42,18],[42,20,42,23],[42,26,42,29],[44,8,44,9],[44,12,44,13],[44,15,44,18],[44,20,44,23],[44,26,44,29],[39,8,39,9],[39,12,39,13],[39,15,39,18],[39,20,39,23],[39,26,39,29],[40,8,40,9],[40,12,40,13],[40,15,40,18],[40,20,40,23],[40,26,40,29],[37,8,37,9],[37,12,37,13],[37,15,37,18],[37,20,37,23],[37,26,37,29],[38,8,38,9],[38,12,38,13],[38,15,38,18],[38,20,38,23],[38,26,38,29],[35,8,35,9],[35,12,35,13],[35,15,35,18],[35,20,35,23],[35,26,35,29],[36,8,36,9],[36,12,36,13],[36,15,36,18],[36,20,36,23],[36,26,36,29],[32,12,32,13],[32,15,32,18],[32,20,32,23],[33,8,33,9],[33,12,33,13],[33,15,33,18],[33,20,33,23],[33,26,33,29],[34,8,34,9],[34,12,34,13],[34,15,34,18],[34,20,34,23],[34,26,34,29],[24,8,24,9],[24,16,24,21],[24,22,24,23],[25,8,25,9],[26,8,26,9],[26,16,26,21],[26,22,26,23],[26,26,26,29],[30,3,31,3],[30,6,31,6],[30,8,31,9],[30,12,30,13],[30,15,30,18],[30,20,30,23],[30,26,31,29],[31,15,31,18],[31,20,31,23],[20,5,20,6],[20,8,20,9],[20,11,20,12],[20,16,20,17],[20,19,20,23],[20,25,20,26],[20,30,20,31],[22,16,22,21],[22,22,22,23],[18,5,18,6],[18,8,18,9],[18,11,18,12],[18,16,18,17],[18,19,18,23],[18,25,18,26],[18,30,18,31],[17,5,17,6],[17,8,17,9],[16,25,16,26],[16,30,16,31],[15,5,15,6],[15,8,15,9],[15,11,15,12],[15,16,15,17],[15,19,15,23],[15,25,15,26],[17,11,17,12],[17,16,17,17],[17,19,17,23],[17,25,17,26],[15,30,15,31],[16,5,16,6],[16,8,16,9],[16,11,16,12],[16,16,16,17],[16,19,16,23],[17,30,17,31],[13,19,13,23],[13,25,13,26],[11,25,11,26],[11,30,11,31],[12,30,12,31],[13,30,13,31],[14,5,14,6],[14,8,14,9],[14,11,14,12],[14,16,14,17],[14,19,14,23],[14,25,14,26],[14,30,14,31],[13,5,13,6],[13,8,13,9],[8,30,8,31],[8,33,9,33],[9,19,9,23],[9,25,9,26],[9,30,9,31],[11,5,11,6],[11,8,11,9],[11,11,11,12],[11,16,11,17],[11,19,11,23],[8,1,9,1],[8,28,9,28],[30,1,31,1],[41,8,41,9],[41,12,41,13],[41,15,41,18],[41,20,41,23],[41,26,41,29],[8,3,9,3],[8,5,9,6],[8,8,9,9],[8,11,9,12],[8,14,9,14],[8,16,9,17],[8,19,8,23],[8,25,8,26],[12,5,12,6],[12,8,12,9],[12,11,12,12],[12,16,12,17],[12,19,12,23],[12,25,12,26],[13,11,13,12],[13,16,13,17]]}
[]
[null,null,null,null,null,null,null,null,null,null,null,null,null,null,null,null," Cost Break Down"]
[]
[null,null,null,null,null,null,null,null,null,null,null,null,null,null,null,null,null,null,null,null,"TOOLING COST DETAILS"]
[]
[]
[null,null,null,"PRODUCTION TOOLING DETAILS:"]
[]
[null,"SUPPLIER NAME",null,"Op #",null,"TOOL DESCRIPTION",null,null,"LEAD TIME\n(WKS)",null,null,"TOOL\nL x W x H",null,null,"TOOL\nUOM",null,"STEEL TYPE",null,null,null,null,null,null,null,null,null,null,null,"POTENTIAL SOURCE LOCATION (COUNTRY)",null,null,null,null,"# OF CAVITIES"]
[null,null,null,null,null,null,null,null,null,null,null,null,null,null,null,null,null,null,null,"TOOL FEATURES",null,null,null,null,null,"POTENTIAL SOURCE",null,null,null,null,"TOOL CAPACITY",null,null,null,null,"CAPACITY\n@ HRS/DAY",null,"CAPACITY \n@ DAYS/WK",null,"PCS/HR"]
[]
[null,{"$f":"Vertical_Cost_Break_Down!H44","v":0}]
[null,{"$f":"Vertical_Cost_Break_Down!I44","v":0}]
[null,{"$f":"Vertical_Cost_Break_Down!J44","v":0},null,null,null,null,null,null,null,null,null,null,null,null,null,null,null,null,null,null,null,null,null,null,null,null,null,null,null,0]
[null,{"$f":"Vertical_Cost_Break_Down!K44","v":0}]
[null,{"$f":"Vertical_Cost_Break_Down!L44","v":0},null,null,null," ",null,null," ",null,null,null,null,null,null,null,null,null,null,null,null,null,null,null," ",null,null,null,null," "]
[null,{"$f":"Vertical_Cost_Break_Down!M44","v":0},null,null,null," ",null,null," ",null,null,null,null,null,null,null,null,null,null,null,null,null,null,null," ",null,null,null,null," "]
[null,{"$f":"Vertical_Cost_Break_Down!N44","v":0},null,null,null," ",null,null," ",null,null,null,null,null,null,null,null,null,null,null,null,null,null,null," "]
[null,{"$f":"Vertical_Cost_Break_Down!O44","v":0},null,null,null," ",null,null," ",null,null,null,null,null,null,null,null,null,null,null,null,null,null,null," "]
[null,{"$f":"Vertical_Cost_Break_Down!P44","v":0}]
[null,{"$f":"Vertical_Cost_Break_Down!Q44","v":0},null,null,null,null,null,null," "]
[]
[null,null,null,null,null,null,null,null,null,null,null,null,null,null,null,null,"# OF STATIONS:"]
[]
[null,null,null,null,null,null,null,"TOTAL LEAD TIME:",{"$f":"SUM(I12:J21)","v":0},null,null,null,null,null,null,null,"CAD/CAM SOFTWARE USED:"]
[]
[null,null,null,null,null,null,null,"MAXIMUM LEAD TIME:",{"$f":"MAX(I12:J21)","v":0},null,null,null,null,null,null,null,"MACHINE TONNAGE:",null,null,null,null,null,null,null,"UOM:"]
[]
[null,null,null,"PRODUCTION TOOLING COSTS DETAIL:"]
[]
{"$rows_left_out":25}
{"sheet":"Definitions","index":2,"n_rows":142,"n_cols":12,"rows_kept":142,"cut":false,"hidden":false,"merged":[[5,2,5,6],[35,2,35,6],[19,2,19,6],[139,10,141,10],[69,2,69,6],[108,2,108,6],[83,2,83,6],[46,2,46,6]]}
[]
[null,"         Vertical Cost Breakdown Worksheet"]
[null,"Definitions and Instructions"]
[]
[null,null,"Breakdown Sheet Field",null,null,"Definition & Instructions","Responsible"]
[null,null,"Forex Information"]
[null,null,null,null,"Supplier Local Currency :","Enter the local currency at the Supplier's manufacturing location, or currency part quoted in.\nMUST ENTER CURRENCY CODE OR BREAKDOWN SHEET WILL ASSUME SAME AS \"USD\"","User"]
[null,null,null,null,"Customer Currency :","Currency Customer will use to pay the supplier.","User"]
[null,null,"A) General Information"]
[null,null,null,null,"Supplier Name :","Enter the full supplier name associated with the Customer Supplier Code.","User"]
[null,null,null,null,"Supplier Mfg. Location :","Enter the supplier’s manufacturing location, including city, state/province/etc. and country. \n(Country of Origin)","User"]
[null,null,null,null,"RFQ Number :","Request For Quote number assigned by Customer","User"]
[null,null,null,null,"Capital Tooling Cost ( Not in selling price)","Specify capital tooling cost e.g. die cost etc\n this cost considered separate from selling , to amortize the tooling cost use amortization section","User"]
[null,null,null,null,"Part Description :","Customer part description","User"]
[null,null,null,null,"Customer Part # :","Enter Customer part number","User"]
[null,null,null,null,"Total Net Cycle Time","Total   Net cycle time of all the manufacturing process  with manufacturing Inefficiencies","Calculated"]
[null,null,null,null,"Annual Volume:","Enter annual volume of the component","User"]
[null,null,null,null,"# of Production Runs Per Year","Enter the number of production runs required to produce annual volume","User"]
[null,null,null,null,"Lot Run Size","This is auto calculated based on Volume and lot Run size (Can be overwritten)","Calculated/User"]
[null,null,"B) Raw Material"]
[null,null,null,null,"Material Description","Describe the raw material.  Include: material type, grade/spec., size ( thickness, blank size, diameter ), shape, and stock ( sheet, coil, bar, drum ).  Example: 1215 Steel - 0.7969 - Round Bar Stock","User"]
[null,null,null,null,"Quantity Per part","Identify the quantity of parts with the specified gross material amount required per part.","User"]
[null,null,null,null,"Gross Material Amount","Enter the amount of material required for processing.  This is generally considered the \"BLANK SIZE\".","User"]
[null,null,null,null,"Net Material Amount","Enter the amount of material remaining after processing","User"]
[null,null,null,null,"Unit of Measure (UoM)","Identify the unit of measurement for the amount of material (example: lb., kg., ml, etc.)","User"]
[null,null,null,null,"Base Cost (Local Currency) / UoM","Identify in local currency, per unit of measure, the cost assumption for the base portion of the raw material cost","User"]
[]
[null,null,null,null,"Resale Value ( Local Currency ) / UoM","Identify value of recycle material per unit of measure.","User"]
[null,null,null,null,"Material Cost ( Local Currency )","Calculation = Gross Material weight * (Cost/UoM *((Gross Material weight - Net Material weight)*Resale Value)*Quantity Per part","Calculated"]
[null,null,null,null,"Supplier Source","Enter the Source Name from Where the Raw Material is Procured","User"]
{"$rows_left_out":113}
{"sheet":"Currency Conversions","index":3,"n_rows":444,"n_cols":8,"rows_kept":444,"cut":false,"hidden":false,"merged":[]}
["LOOKUP","SPPLR CUR","CUST CUR","RATE"]
[{"$f":"B2&\"-\"&C2","v":"USD-USD"},"USD","USD",1]
[{"$f":"B3&\"-\"&C3","v":"AUD-USD"},"AUD","USD",0.73099999999999998]
["BRL-USD","BRL","USD",0.30147723846849561,null,null,null,"USD"]
["CAD-USD","CAD","USD",0.98619329388560162]
["CHF-USD","CHF","USD",0.97943192948090119]
["CNY-USD","CNY","USD",0.1601537475976938]
["CZK-USD","CZK","USD",5.0276461295418642E-2]
["EUR-USD","EUR","USD",1.0529999999999999]
["GBP-USD","GBP","USD",1.4830000000000001]
["HUG-USD","HUG","USD",4.2575250836120399E-3]
["INR-USD","INR","USD",1.5715857300015717E-2]
["JPY-USD","JPY","USD",7.9936051159072742E-3]
["KRW-USD","KRW","USD",8.9525514771709937E-4]
["MXN-USD","MXN","USD",6.1728395061728399E-2]
["NOK-USD","NOK","USD",0.17296195652173912]
["PLN-USD","PLN","USD",0.25967281225655675]
["ROL-USD","ROL","USD",0.28800904977375563]
["RUB-USD","RUB","USD",3.2258064516129031E-2]
["SEK-USD","SEK","USD",0.15287618590128496]
["TRY-USD","TRY","USD",0.36832412523020258]
["TWD-USD","TWD","USD",3.1374517616791643E-2]
["USD-AUD","USD","AUD",1.3679890560875514]
["USD-BRL","USD","BRL",3.3170000000000002]
["USD-CAD","USD","CAD",1.014]
["USD-CHF","USD","CHF",1.0209999999999999]
["USD-CNY","USD","CNY",6.2439999999999998]
["USD-CZK","USD","CZK",19.890023566378634]
["USD-EUR","USD","EUR",0.94966761633428309]
["USD-GBP","USD","GBP",0.67430883344571813]
{"$rows_left_out":414}